{"text_format":"1","workbook":"xlsx","n_sheets":10,"sheets":["1 Vorbereitung","2 Stärken-Schwächen-Analyse","3 Chancen-Risiken-Analyse","4 SWOT-Übersicht","5 SWOT-Matrix ausgeblendet","5 SWOT-Matrix","6 Berechnetes Spinnenprofil","7 Einfaches Spinnenprofil","8 Polaritätsprofil","9 Werte"],"not_rendered":{"charts":3,"images":1,"macros":1,"external_links":0,"defined_names":10,"comments":0,"pivot_tables":8},"unopened":[],"bounds":{"document_bytes":16777216,"sheet_cells":100000,"rows_first":2000,"rows_last":500,"rows_between":2000,"halvings":0,"cell_chars":16384,"cell_head_chars":4096},"cells_cut":0,"cells_raw":0,"read":"whole","date_system":"1900"}

{"sheet":"1 Vorbereitung","index":0,"n_rows":106,"n_cols":16381,"rows_kept":106,"cut":false,"hidden":false,"merged":[[99,3,99,5],[101,3,101,5],[103,3,103,5],[105,3,105,5],[3,1,3,5],[4,1,4,5],[95,3,95,5],[97,3,97,5],[72,2,72,6],[73,2,73,6],[34,2,34,6],[13,2,13,6],[33,2,33,6],[52,1,53,1],[36,1,37,1]]}
[]
[]
["Erfolgsfaktoren kantonaler Alkoholpolitik"]
[null,"Ein Instrument für die Kantone"]
[]
[]
[null,null,null,"Ausgefüllt durch",null,"Datum"]
[]
[]
[]
[]
[null,"Vorbereitung "]
[]
[null,null,"1. Mitglieder der Arbeitsgruppe Erfolgsfaktoren\n"]
[]
[null,null,null,"Name",null,"Bemerkungen "]
[]
[]
[]
[]
[]
[]
[]
[]
[]
[]
[]
[]
[]
[]
[]
[]
[]
[null,null,"2. Stakeholder-Identifikation"]
[null,null,"Welche Akteure sind für die kantonale Alkoholpolitik relevant?\nAlle Stellen, Institutionen und Organisationen, die an der kantonalen Alkoholpolitik beteiligt oder von ihr betroffen sind."]
[]
[null,"Verwaltungsinterne Stellen",null,"Akteure ",null,"Bemerkungen "]
[]
[null,"Gesundheit"]
[]
[null,"Wirtschaft "]
[]
[null,"Sicherheit"]
[]
[null,"Bildung"]
[]
[null,"Stadtentwicklung"]
[]
[null,"Soziales/Integration"]
[]
[]
[]
[null,"Verwaltungsexterne Stellen/ privatrechtliche Institutionen",null,"Akteure ",null,"Bemerkungen"]
[]
[null,"Suchtpräventionsstellen"]
[]
[null,"Ambulante Dienste"]
[]
[null,"Spitäler/(Haus-)ärzteschaft"]
[]
[null,"Wirtschaft"]
[]
[null,"Fachverbände"]
[]
[null,"Jugendarbeit/Kirche/Vereine"]
[]
[null,"Gemeinden"]
[]
[null,"Andere"]
[]
[]
[]
[null,null,"Welche der genannten Akteure sollen in die allfällige Erarbeitung einer Strategie oder eines Aktionsplans einbezogen werden?\nz.B. Zuständige kantonale Stelle(n) und wichtigste Umsetzungspartner/Partner mit Leistungsverträgen, bestehende Programmgremien usw.",null,null,null,null,null,"1. Welche Akteure sollen aktiv in den Erarbeitungsprozess einbezogen werden? ",null,null,null,null,null,null,null,"1. Welche Akteure sollen aktiv in den Erarbeitungsprozess einbezogen werden? ",null,null,null,null,null,null,null,"1. Welche Akteure sollen aktiv in den Erarbeitungsprozess einbezogen werden? ",null,null,null,null,null,null,null,"1. Welche Akteure sollen aktiv in den Erarbeitungsprozess einbezogen werden? ",null,null,null,null,null,null,null,"1. Welche Akteure sollen aktiv in den Erarbeitungsprozess einbezogen werden? ",null,null,null,null,null,null,null,"1. Welche Akteure sollen aktiv in den Erarbeitungsprozess einbezogen werden? ",null,null,null,null,null,null,null,"1. Welche Akteure sollen aktiv in den Erarbeitungsprozess einbezogen werden? ",null,null,null,null,null,null,null,"1. Welche Akteure sollen aktiv in den Erarbeitungsprozess einbezogen werden? ",null,null,null,null,null,null,null,"1. Welche Akteure sollen aktiv in den Erarbeitungsprozess einbezogen werden? ",null,null,null,null,null,null,null,"1. Welche Akteure sollen aktiv in den Erarbeitungsprozess einbezogen werden? ",null,null,null,null,null,null,null,"1. Welche Akteure sollen aktiv in den Erarbeitungsprozess einbezogen werden? ",null,null,null,null,null,null,null,"1. Welche Akteure sollen aktiv in den Erarbeitungsprozess einbezogen werden? ",null,null,null,null,null,null,null,"1. Welche Akteure sollen aktiv in den Erarbeitungsprozess einbezogen werden? ",null,null,null,null,null,null,null,"1. Welche Akteure sollen aktiv in den Erarbeitungsprozess einbezogen werden? ",null,null,null,null,null,null,null,"1. Welche Akteure sollen aktiv in den Erarbeitungsprozess einbezogen werden? ",null,null,null,null,null,null,null,"1. Welche Akteure sollen aktiv in den Erarbeitungsprozess einbezogen werden? ",null,null,null,null,null,null,null,"1. Welche Akteure sollen aktiv in den Erarbeitungsprozess einbezogen werden? ",null,null,null,null,null,null,null,"1. Welche Akteure sollen aktiv in den Erarbeitungsprozess einbezogen werden? ",null,null,null,null,null,null,null,"1. Welche Akteure sollen aktiv in den Erarbeitungsprozess einbezogen werden? ",null,null,null,null,null,null,null,"1. Welche Akteure sollen aktiv in den Erarbeitungsprozess einbezogen werden? ",null,null,null,null,null,null,null,"1. Welche Akteure sollen aktiv in den Erarbeitungsprozess einbezogen werden? ",null,null,null,null,null,null,null,"1. Welche Akteure sollen aktiv in den Erarbeitungsprozess einbezogen werden? ",null,null,null,null,null,null,null,"1. Welche Akteure sollen aktiv in den Erarbeitungsprozess einbezogen werden? ",null,null,null,null,null,null,null,"1. Welche Akteure sollen aktiv in den Erarbeitungsprozess einbezogen werden? ",null,null,null,null,null,null,null,"1. Welche Akteure sollen aktiv in den Erarbeitungsprozess einbezogen werden? ",null,null,null,null,null,null,null,"1. Welche Akteure sollen aktiv in den Erarbeitungsprozess einbezogen werden? ",null,null,null,null,null,null,null,"1. Welche Akteure sollen aktiv in den Erarbeitungsprozess einbezogen werden? ",null,null,null,null,null,null,null,"1. Welche Akteure sollen aktiv in den Erarbeitungsprozess einbezogen werden? ",null,null,null,null,null,null,null,"1. Welche Akteure sollen aktiv in den Erarbeitungsprozess einbezogen werden? ",null,null,null,null,null,null,null,"1. Welche Akteure sollen aktiv in den Erarbeitungsprozess einbezogen werden? ",null,null,null,null,null,null,null,"1. Welche Akteure sollen aktiv in den Erarbeitungsprozess einbezogen werden? ",null,null,null,null,null,null,null,"1. Welche Akteure sollen aktiv in den Erarbeitungsprozess einbezogen werden? ",null,null,null,null,null,null,null,"1. Welche Akteure sollen aktiv in den Erarbeitungsprozess einbezogen werden? ",null,null,null,null,null,null,null,"1. Welche Akteure sollen aktiv in den Erarbeitungsprozess einbezogen werden? ",null,null,null,null,null,null,null,"1. Welche Akteure sollen aktiv in den Erarbeitungsprozess einbezogen werden? ",null,null,null,null,null,null,null,"1. Welche Akteure sollen aktiv in den Erarbeitungsprozess einbezogen werden? ",null,null,null,null,null,null,null,"1. Welche Akteure sollen aktiv in den Erarbeitungsprozess einbezogen werden? ",null,null,null,null,null,null,null,"1. Welche Akteure sollen aktiv in den Erarbeitungsprozess einbezogen werden? ",null,null,null,null,null,null,null,"1. Welche Akteure sollen aktiv in den Erarbeitungsprozess einbezogen werden? ",null,null,null,null,null,null,null,"1. Welche Akteure sollen aktiv in den Erarbeitungsprozess einbezogen werden? ",null,null,null,null,null,null,null,"1. Welche Akteure sollen aktiv in den Erarbeitungsprozess einbezogen werden? ",null,null,null,null,null,null,null,"1. Welche Akteure sollen aktiv in den Erarbeitungsprozess einbezogen werden? ",null,null,null,null,null,null,null,"1. Welche Akteure sollen aktiv in den Erarbeitungsprozess einbezogen werden? ",null,null,null,null,null,null,null,"1. Welche Akteure sollen aktiv in den Erarbeitungsprozess einbezogen werden? ",null,null,null,null,null,null,null,"1. Welche Akteure sollen aktiv in den Erarbeitungsprozess einbezogen werden? ",null,null,null,null,null,null,null,"1. Welche Akteure sollen aktiv in den Erarbeitungsprozess einbezogen werden? ",null,null,null,null,null,null,null,"1. Welche Akteure sollen aktiv in den Erarbeitungsprozess einbezogen werden? ",null,null,null,null,null,null,null,"1. Welche Akteure sollen aktiv in den Erarbeitungsprozess einbezogen werden? ",null,null,null,null,null,null,null,"1. Welche Akteure sollen aktiv in den Erarbeitungsprozess einbezogen werden? ",null,null,null,null,null,null,null,"1. Welche Akteure sollen aktiv in den Erarbeitungsprozess einbezogen werden? ",null,null,null,null,null,null,null,"1. Welche Akteure sollen aktiv in den Erarbeitungsprozess einbezogen werden? ",null,null,null,null,null,null,null,"1. Welche Akteure sollen aktiv in den Erarbeitungsprozess einbezogen werden? ",null,null,null,null,null,null,null,"1. Welche Akteure sollen aktiv in den Erarbeitungsprozess einbezogen werden? ",null,null,null,null,null,null,null,"1. Welche Akteure sollen aktiv in den Erarbeitungsprozess einbezogen werden? ",null,null,null,null,null,null,null,"1. Welche Akteure sollen aktiv in den Erarbeitungsprozess einbezogen werden? ",null,null,null,null,null,null,null,"1. Welche Akteure sollen aktiv in den Erarbeitungsprozess einbezogen werden? ",null,null,null,null,null,null,null,"1. Welche Akteure sollen aktiv in den Erarbeitungsprozess einbezogen werden? ",null,null,null,null,null,null,null,"1. Welche Akteure sollen aktiv in den Erarbeitungsprozess einbezogen werden? ",null,null,null,null,null,null,null,"1. Welche Akteure sollen aktiv in den Erarbeitungsprozess einbezogen werden? ",null,null,null,null,null,null,null,"1. Welche Akteure sollen aktiv in den Erarbeitungsprozess einbezogen werden? ",null,null,null,null,null,null,null,"1. Welche Akteure sollen aktiv in den Erarbeitungsprozess einbezogen werden? ",null,null,null,null,null,null,null,"1. Welche Akteure sollen aktiv in den Erarbeitungsprozess einbezogen werden? ",null,null,null,null,null,null,null,"1. Welche Akteure sollen aktiv in den Erarbeitungsprozess einbezogen werden? ",null,null,null,null,null,null,null,"1. Welche Akteure sollen aktiv in den Erarbeitungsprozess einbezogen werden? ",null,null,null,null,null,null,null,"1. Welche Akteure sollen aktiv in den Erarbeitungsprozess einbezogen werden? ",null,null,null,null,null,null,null,"1. Welche Akteure sollen aktiv in den Erarbeitungsprozess einbezogen werden? ",null,null,null,null,null,null,null,"1. Welche Akteure sollen aktiv in den Erarbeitungsprozess einbezogen werden? ",null,null,null,null,null,null,null,"1. Welche Akteure sollen aktiv in den Erarbeitungsprozess einbezogen werden? ",null,null,null,null,null,null,null,"1. Welche Akteure sollen aktiv in den Erarbeitungsprozess einbezogen werden? ",null,null,null,null,null,null,null,"1. Welche Akteure sollen aktiv in den Erarbeitungsprozess einbezogen werden? ",null,null,null,null,null,null,null,"1. Welche Akteure sollen aktiv in den Erarbeitungsprozess einbezogen werden? ",null,null,null,null,null,null,null,"1. Welche Akteure sollen aktiv in den Erarbeitungsprozess einbezogen werden? ",null,null,null,null,null,null,null,"1. Welche Akteure sollen aktiv in den Erarbeitungsprozess einbezogen werden? ",null,null,null,null,null,null,null,"1. Welche Akteure sollen aktiv in den Erarbeitungsprozess einbezogen werden? ",null,null,null,null,null,null,null,"1. Welche Akteure sollen aktiv in den Erarbeitungsprozess einbezogen werden? ",null,null,null,null,null,null,null,"1. Welche Akteure sollen aktiv in den Erarbeitungsprozess einbezogen werden? ",null,null,null,null,null,null,null,"1. Welche Akteure sollen aktiv in den Erarbeitungsprozess einbezogen werden? ",null,null,null,null,null,null,null,"1. Welche Akteure sollen aktiv in den Erarbeitungsprozess einbezogen werden? ",null,null,null,null,null,null,null,"1. Welche Akteure sollen aktiv in den Erarbeitungsprozess einbezogen werden? ",null,null,null,null,null,null,null,"1. Welche Akteure sollen aktiv in den Erarbeitungsprozess einbezogen werden? ",null,null,null,null,null,null,null,"1. Welche Akteure sollen aktiv in den Erarbeitungsprozess einbezogen werden? ",null,null,null,null,null,null,null,"1. Welche Akteure sollen aktiv in den Erarbeitungsprozess einbezogen werden? ",null,null,null,null,null,null,null,"1. Welche Akteure sollen aktiv in den Erarbeitungsprozess einbezogen werden? ",null,null,null,null,null,null,null,"1. Welche Akteure sollen aktiv in den Erarbeitungsprozess einbezogen werden? ",null,null,null,null,null,null,null,"1. Welche Akteure sollen aktiv in den Erarbeitungsprozess einbezogen werden? ",null,null,null,null,null,null,null,"1. Welche Akteure sollen aktiv in den Erarbeitungsprozess einbezogen werden? ",null,null,null,null,null,null,null,"1. Welche Akteure sollen aktiv in den Erarbeitungsprozess einbezogen werden? ",null,null,null,null,null,null,null,"1. Welche Akteure sollen aktiv in den Erarbeitungsprozess einbezogen werden? ",null,null,null,null,null,null,null,"1. Welche Akteure sollen aktiv in den Erarbeitungsprozess einbezogen werden? ",null,null,null,null,null,null,null,"1. Welche Akteure sollen aktiv in den Erarbeitungsprozess einbezogen werden? ",null,null,null,null,null,null,null,"1. Welche Akteure sollen aktiv in den Erarbeitungsprozess einbezogen werden? ",null,null,null,null,null,null,null,"1. Welche Akteure sollen aktiv in den Erarbeitungsprozess einbezogen werden? ",null,null,null,null,null,null,null,"1. Welche Akteure sollen aktiv in den Erarbeitungsprozess einbezogen werden? ",null,null,null,null,null,null,null,"1. Welche Akteure sollen aktiv in den Erarbeitungsprozess einbezogen werden? ",null,null,null,null,null,null,null,"1. Welche Akteure sollen aktiv in den Erarbeitungsprozess einbezogen werden? ",null,null,null,null,null,null,null,"1. Welche Akteure sollen aktiv in den Erarbeitungsprozess einbezogen werden? ",null,null,null,null,null,null,null,"1. Welche Akteure sollen aktiv in den Erarbeitungsprozess einbezogen werden? ",null,null,null,null,null,null,null,"1. Welche Akteure sollen aktiv in den Erarbeitungsprozess einbezogen werden? ",null,null,null,null,null,null,null,"1. Welche Akteure sollen aktiv in den Erarbeitungsprozess einbezogen werden? ",null,null,null,null,null,null,null,"1. Welche Akteure sollen aktiv in den Erarbeitungsprozess einbezogen werden? ",null,null,null,null,null,null,null,"1. Welche Akteure sollen aktiv in den Erarbeitungsprozess einbezogen werden? ",null,null,null,null,null,null,null,"1. Welche Akteure sollen aktiv in den Erarbeitungsprozess einbezogen werden? ",null,null,null,null,null,null,null,"1. Welche Akteure sollen aktiv in den Erarbeitungsprozess einbezogen werden? ",null,null,null,null,null,null,null,"1. Welche Akteure sollen aktiv in den Erarbeitungsprozess einbezogen werden? ",null,null,null,null,null,null,null,"1. Welche Akteure sollen aktiv in den Erarbeitungsprozess einbezogen werden? ",null,null,null,null,null,null,null,"1. Welche Akteure sollen aktiv in den Erarbeitungsprozess einbezogen werden? ",null,null,null,null,null,null,null,"1. Welche Akteure sollen aktiv in den Erarbeitungsprozess einbezogen werden? ",null,null,null,null,null,null,null,"1. Welche Akteure sollen aktiv in den Erarbeitungsprozess einbezogen werden? ",null,null,null,null,null,null,null,"1. Welche Akteure sollen aktiv in den Erarbeitungsprozess einbezogen werden? ",null,null,null,null,null,null,null,"1. Welche Akteure sollen aktiv in den Erarbeitungsprozess einbezogen werden? ",null,null,null,null,null,null,null,"1. Welche Akteure sollen aktiv in den Erarbeitungsprozess einbezogen werden? ",null,null,null,null,null,null,null,"1. Welche Akteure sollen aktiv in den Erarbeitungsprozess einbezogen werden? ",null,null,null,null,null,null,null,"1. Welche Akteure sollen aktiv in den Erarbeitungsprozess einbezogen werden? ",null,null,null,null,null,null,null,"1. Welche Akteure sollen aktiv in den Erarbeitungsprozess einbezogen werden? ",null,null,null,null,null,null,null,"1. Welche Akteure sollen aktiv in den Erarbeitungsprozess einbezogen werden? ",null,null,null,null,null,null,null,"1. Welche Akteure sollen aktiv in den Erarbeitungsprozess einbezogen werden? ",null,null,null,null,null,null,null,"1. Welche Akteure sollen aktiv in den Erarbeitungsprozess einbezogen werden? ",null,null,null,null,null,null,null,"1. Welche Akteure sollen aktiv in den Erarbeitungsprozess einbezogen werden? ",null,null,null,null,null,null,null,"1. Welche Akteure sollen aktiv in den Erarbeitungsprozess einbezogen werden? ",null,null,null,null,null,null,null,"1. Welche Akteure sollen aktiv in den Erarbeitungsprozess einbezogen werden? ",null,null,null,null,null,null,null,"1. Welche Akteure sollen aktiv in den Erarbeitungsprozess einbezogen werden? ",null,null,null,null,null,null,null,"1. Welche Akteure sollen aktiv in den Erarbeitungsprozess einbezogen werden? ",null,null,null,null,null,null,null,"1. Welche Akteure sollen aktiv in den Erarbeitungsprozess einbezogen werden? ",null,null,null,null,null,null,null,"1. Welche Akteure sollen aktiv in den Erarbeitungsprozess einbezogen werden? ",null,null,null,null,null,null,null,"1. Welche Akteure sollen aktiv in den Erarbeitungsprozess einbezogen werden? ",null,null,null,null,null,null,null,"1. Welche Akteure sollen aktiv in den Erarbeitungsprozess einbezogen werden? ",null,null,null,null,null,null,null,"1. Welche Akteure sollen aktiv in den Erarbeitungsprozess einbezogen werden? ",null,null,null,null,null,null,null,"1. Welche Akteure sollen aktiv in den Erarbeitungsprozess einbezogen werden? ",null,null,null,null,null,null,null,"1. Welche Akteure sollen aktiv in den Erarbeitungsprozess einbezogen werden? ",null,null,null,null,null,null,null,"1. Welche Akteure sollen aktiv in den Erarbeitungsprozess einbezogen werden? ",null,null,null,null,null,null,null,"1. Welche Akteure sollen aktiv in den Erarbeitungsprozess einbezogen werden? ",null,null,null,null,null,null,null,"1. Welche Akteure sollen aktiv in den Erarbeitungsprozess einbezogen werden? ",null,null,null,null,null,null,null,"1. Welche Akteure sollen aktiv in den Erarbeitungsprozess einbezogen werden? ",null,null,null,null,null,null,null,"1. Welche Akteure sollen aktiv in den Erarbeitungsprozess einbezogen werden? ",null,null,null,null,null,null,null,"1. Welche Akteure sollen aktiv in den Erarbeitungsprozess einbezogen werden? ",null,null,null,null,null,null,null,"1. Welche Akteure sollen aktiv in den Erarbeitungsprozess einbezogen werden? ",null,null,null,null,null,null,null,"1. Welche Akteure sollen aktiv in den Erarbeitungsprozess einbezogen werden? ",null,null,null,null,null,null,null,"1. Welche Akteure sollen aktiv in den Erarbeitungsprozess einbezogen werden? ",null,null,null,null,null,null,null,"1. Welche Akteure sollen aktiv in den Erarbeitungsprozess einbezogen werden? ",null,null,null,null,null,null,null,"1. Welche Akteure sollen aktiv in den Erarbeitungsprozess einbezogen werden? ",null,null,null,null,null,null,null,"1. Welche Akteure sollen aktiv in den Erarbeitungsprozess einbezogen werden? ",null,null,null,null,null,null,null,"1. Welche Akteure sollen aktiv in den Erarbeitungsprozess einbezogen werden? ",null,null,null,null,null,null,null,"1. Welche Akteure sollen aktiv in den Erarbeitungsprozess einbezogen werden? ",null,null,null,null,null,null,null,"1. Welche Akteure sollen aktiv in den Erarbeitungsprozess einbezogen werden? ",null,null,null,null,null,null,null,"1. Welche Akteure sollen aktiv in den Erarbeitungsprozess einbezogen werden? ",null,null,null,null,null,null,null,"1. Welche Akteure sollen aktiv in den Erarbeitungsprozess einbezogen werden? ",null,null,null,null,null,null,null,"1. Welche Akteure sollen aktiv in den Erarbeitungsprozess einbezogen werden? ",null,null,null,null,null,null,null,"1. Welche Akteure sollen aktiv in den Erarbeitungsprozess einbezogen werden? ",null,null,null,null,null,null,null,"1. Welche Akteure sollen aktiv in den Erarbeitungsprozess einbezogen werden? ",null,null,null,null,null,null,null,"1. Welche Akteure sollen aktiv in den Erarbeitungsprozess einbezogen werden? ",null,null,null,null,null,null,null,"1. Welche Akteure sollen aktiv in den Erarbeitungsprozess einbezogen werden? ",null,null,null,null,null,null,null,"1. Welche Akteure sollen aktiv in den Erarbeitungsprozess einbezogen werden? ",null,null,null,null,null,null,null,"1. Welche Akteure sollen aktiv in den Erarbeitungsprozess einbezogen werden? ",null,null,null,null,null,null,null,"1. Welche Akteure sollen aktiv in den Erarbeitungsprozess einbezogen werden? ",null,null,null,null,null,null,null,"1. Welche Akteure sollen aktiv in den Erarbeitungsprozess einbezogen werden? ",null,null,null,null,null,null,null,"1. Welche Akteure sollen aktiv in den Erarbeitungsprozess einbezogen werden? ",null,null,null,null,null,null,null,"1. Welche Akteure sollen aktiv in den Erarbeitungsprozess einbezogen werden? ",null,null,null,null,null,null,null,"1. Welche Akteure sollen aktiv in den Erarbeitungsprozess einbezogen werden? ",null,null,null,null,null,null,null,"1. Welche Akteure sollen aktiv in den Erarbeitungsprozess einbezogen werden? ",null,null,null,null,null,null,null,"1. Welche Akteure sollen aktiv in den Erarbeitungsprozess einbezogen werden? ",null,null,null,null,null,null,null,"1. Welche Akteure sollen aktiv in den Erarbeitungsprozess einbezogen werden? ",null,null,null,null,null,null,null,"1. Welche Akteure sollen aktiv in den Erarbeitungsprozess einbezogen werden? ",null,null,null,null,null,null,null,"1. Welche Akteure sollen aktiv in den Erarbeitungsprozess einbezogen werden? ",null,null,null,null,null,null,null,"1. Welche Akteure sollen aktiv in den Erarbeitungsprozess einbezogen werden? ",null,null,null,null,null,null,null,"1. Welche Akteure sollen aktiv in den Erarbeitungsprozess einbezogen werden? ",null,null,null,null,null,null,null,"1. Welche Akteure sollen aktiv in den Erarbeitungsprozess einbezogen werden? ",null,null,null,null,null,null,null,"1. Welche Akteure sollen aktiv in den Erarbeitungsprozess einbezogen werden? ",null,null,null,null,null,null,null,"1. Welche Akteure sollen aktiv in den Erarbeitungsprozess einbezogen werden? ",null,null,null,null,null,null,null,"1. Welche Akteure sollen aktiv in den Erarbeitungsprozess einbezogen werden? ",null,null,null,null,null,null,null,"1. Welche Akteure sollen aktiv in den Erarbeitungsprozess einbezogen werden? ",null,null,null,null,null,null,null,"1. Welche Akteure sollen aktiv in den Erarbeitungsprozess einbezogen werden? ",null,null,null,null,null,null,null,"1. Welche Akteure sollen aktiv in den Erarbeitungsprozess einbezogen werden? ",null,null,null,null,null,null,null,"1. Welche Akteure sollen aktiv in den Erarbeitungsprozess einbezogen werden? ",null,null,null,null,null,null,null,"1. Welche Akteure sollen aktiv in den Erarbeitungsprozess einbezogen werden? ",null,null,null,null,null,null,null,"1. Welche Akteure sollen aktiv in den Erarbeitungsprozess einbezogen werden? ",null,null,null,null,null,null,null,"1. Welche Akteure sollen aktiv in den Erarbeitungsprozess einbezogen werden? ",null,null,null,null,null,null,null,"1. Welche Akteure sollen aktiv in den Erarbeitungsprozess einbezogen werden? ",null,null,null,null,null,null,null,"1. Welche Akteure sollen aktiv in den Erarbeitungsprozess einbezogen werden? ",null,null,null,null,null,null,null,"1. Welche Akteure sollen aktiv in den Erarbeitungsprozess einbezogen werden? ",null,null,null,null,null,null,null,"1. Welche Akteure sollen aktiv in den Erarbeitungsprozess einbezogen werden? ",null,null,null,null,null,null,null,"1. Welche Akteure sollen aktiv in den Erarbeitungsprozess einbezogen werden? ",null,null,null,null,null,null,null,"1. Welche Akteure sollen aktiv in den Erarbeitungsprozess einbezogen werden? ",null,null,null,null,null,null,null,"1. Welche Akteure sollen aktiv in den Erarbeitungsprozess einbezogen werden? ",null,null,null,null,null,null,null,"1. Welche Akteure sollen aktiv in den Erarbeitungsprozess einbezogen werden? ",null,null,null,null,null,null,null,"1. Welche Akteure sollen aktiv in den Erarbeitungsprozess einbezogen werden? ",null,null,null,null,null,null,null,"1. Welche Akteure sollen aktiv in den Erarbeitungsprozess einbezogen werden? ",null,null,null,null,null,null,null,"1. Welche Akteure sollen aktiv in den Erarbeitungsprozess einbezogen werden? ",null,null,null,null,null,null,null,"1. Welche Akteure sollen aktiv in den Erarbeitungsprozess einbezogen werden? ",null,null,null,null,null,null,null,"1. Welche Akteure sollen aktiv in den Erarbeitungsprozess einbezogen werden? ",null,null,null,null,null,null,null,"1. Welche Akteure sollen aktiv in den Erarbeitungsprozess einbezogen werden? ",null,null,null,null,null,null,null,"1. Welche Akteure sollen aktiv in den Erarbeitungsprozess einbezogen werden? ",null,null,null,null,null,null,null,"1. Welche Akteure sollen aktiv in den Erarbeitungsprozess einbezogen werden? ",null,null,null,null,null,null,null,"1. Welche Akteure sollen aktiv in den Erarbeitungsprozess einbezogen werden? ",null,null,null,null,null,null,null,"1. Welche Akteure sollen aktiv in den Erarbeitungsprozess einbezogen werden? ",null,null,null,null,null,null,null,"1. Welche Akteure sollen aktiv in den Erarbeitungsprozess einbezogen werden? ",null,null,null,null,null,null,null,"1. Welche Akteure sollen aktiv in den Erarbeitungsprozess einbezogen werden? ",null,null,null,null,null,null,null,"1. Welche Akteure sollen aktiv in den Erarbeitungsprozess einbezogen werden? ",null,null,null,null,null,null,null,"1. Welche Akteure sollen aktiv in den Erarbeitungsprozess einbezogen werden? ",null,null,null,null,null,null,null,"1. Welche Akteure sollen aktiv in den Erarbeitungsprozess einbezogen werden? ",null,null,null,null,null,null,null,"1. Welche Akteure sollen aktiv in den Erarbeitungsprozess einbezogen werden? ",null,null,null,null,null,null,null,"1. Welche Akteure sollen aktiv in den Erarbeitungsprozess einbezogen werden? ",null,null,null,null,null,null,null,"1. Welche Akteure sollen aktiv in den Erarbeitungsprozess einbezogen werden? ",null,null,null,null,null,null,null,"1. Welche Akteure sollen aktiv in den Erarbeitungsprozess einbezogen werden? ",null,null,null,null,null,null,null,"1. Welche Akteure sollen aktiv in den Erarbeitungsprozess einbezogen werden? ",null,null,null,null,null,null,null,"1. Welche Akteure sollen aktiv in den Erarbeitungsprozess einbezogen werden? ",null,null,null,null,null,null,null,"1. Welche Akteure sollen aktiv in den Erarbeitungsprozess einbezogen werden? ",null,null,null,null,null,null,null,"1. Welche Akteure sollen aktiv in den Erarbeitungsprozess einbezogen werden? ",null,null,null,null,null,null,null,"1. Welche Akteure sollen aktiv in den Erarbeitungsprozess einbezogen werden? ",null,null,null,null,null,null,null,"1. Welche Akteure sollen aktiv in den Erarbeitungsprozess einbezogen werden? ",null,null,null,null,null,null,null,"1. Welche Akteure sollen aktiv in den Erarbeitungsprozess einbezogen werden? ",null,null,null,null,null,null,null,"1. Welche Akteure sollen aktiv in den Erarbeitungsprozess einbezogen werden? ",null,null,null,null,null,null,null,"1. Welche Akteure sollen aktiv in den Erarbeitungsprozess einbezogen werden? ",null,null,null,null,null,null,null,"1. Welche Akteure sollen aktiv in den Erarbeitungsprozess einbezogen werden? ",null,null,null,null,null,null,null,"1. Welche Akteure sollen aktiv in den Erarbeitungsprozess einbezogen werden? ",null,null,null,null,null,null,null,"1. Welche Akteure sollen aktiv in den Erarbeitungsprozess einbezogen werden? ",null,null,null,null,null,null,null,"1. Welche Akteure sollen aktiv in den Erarbeitungsprozess einbezogen werden? ",null,null,null,null,null,null,null,"1. Welche Akteure sollen aktiv in den Erarbeitungsprozess einbezogen werden? ",null,null,null,null,null,null,null,"1. Welche Akteure sollen aktiv in den Erarbeitungsprozess einbezogen werden? ",null,null,null,null,null,null,null,"1. Welche Akteure sollen aktiv in den Erarbeitungsprozess einbezogen werden? ",null,null,null,null,null,null,null,"1. Welche Akteure sollen aktiv in den Erarbeitungsprozess einbezogen werden? ",null,null,null,null,null,null,null,"1. Welche Akteure sollen aktiv in den Erarbeitungsprozess einbezogen werden? ",null,null,null,null,null,null,null,"1. Welche Akteure sollen aktiv in den Erarbeitungsprozess einbezogen werden? ",null,null,null,null,null,null,null,"1. Welche Akteure sollen aktiv in den Erarbeitungsprozess einbezogen werden? ",null,null,null,null,null,null,null,"1. Welche Akteure sollen aktiv in den Erarbeitungsprozess einbezogen werden? ",null,null,null,null,null,null,null,"1. Welche Akteure sollen aktiv in den Erarbeitungsprozess einbezogen werden? ",null,null,null,null,null,null,null,"1. Welche Akteure sollen aktiv in den Erarbeitungsprozess einbezogen werden? ",null,null,null,null,null,null,null,"1. Welche Akteure sollen aktiv in den Erarbeitungsprozess einbezogen werden? ",null,null,null,null,null,null,null,"1. Welche Akteure sollen aktiv in den Erarbeitungsprozess einbezogen werden? ",null,null,null,null,null,null,null,"1. Welche Akteure sollen aktiv in den Erarbeitungsprozess einbezogen werden? ",null,null,null,null,null,null,null,"1. Welche Akteure sollen aktiv in den Erarbeitungsprozess einbezogen werden? ",null,null,null,null,null,null,null,"1. Welche Akteure sollen aktiv in den Erarbeitungsprozess einbezogen werden? ",null,null,null,null,null,null,null,"1. Welche Akteure sollen aktiv in den Erarbeitungsprozess einbezogen werden? ",null,null,null,null,null,null,null,"1. Welche Akteure sollen aktiv in den Erarbeitungsprozess einbezogen werden? ",null,null,null,null,null,null,null,"1. Welche Akteure sollen aktiv in den Erarbeitungsprozess einbezogen werden? ",null,null,null,null,null,null,null,"1. Welche Akteure sollen aktiv in den Erarbeitungsprozess einbezogen werden? ",null,null,null,null,null,null,null,"1. Welche Akteure sollen aktiv in den Erarbeitungsprozess einbezogen werden? ",null,null,null,null,null,null,null,"1. Welche Akteure sollen aktiv in den Erarbeitungsprozess einbezogen werden? ",null,null,null,null,null,null,null,"1. Welche Akteure sollen aktiv in den Erarbeitungsprozess einbezogen werden? ",null,null,null,null,null,null,null,"1. Welche Akteure sollen aktiv in den Erarbeitungsprozess einbezogen werden? ",null,null,null,null,null,null,null,"1. Welche Akteure sollen aktiv in den Erarbeitungsprozess einbezogen werden? ",null,null,null,null,null,null,null,"1. Welche Akteure sollen aktiv in den Erarbeitungsprozess einbezogen werden? ",null,null,null,null,null,null,null,"1. Welche Akteure sollen aktiv in den Erarbeitungsprozess einbezogen werden? ",null,null,null,null,null,null,null,"1. Welche Akteure sollen aktiv in den Erarbeitungsprozess einbezogen werden? ",null,null,null,null,null,null,null,"1. Welche Akteure sollen aktiv in den Erarbeitungsprozess einbezogen werden? ",null,null,null,null,null,null,null,"1. Welche Akteure sollen aktiv in den Erarbeitungsprozess einbezogen werden? ",null,null,null,null,null,null,null,"1. Welche Akteure sollen aktiv in den Erarbeitungsprozess einbezogen werden? ",null,null,null,null,null,null,null,"1. Welche Akteure sollen aktiv in den Erarbeitungsprozess einbezogen werden? ",null,null,null,null,null,null,null,"1. Welche Akteure sollen aktiv in den Erarbeitungsprozess einbezogen werden? ",null,null,null,null,null,null,null,"1. Welche Akteure sollen aktiv in den Erarbeitungsprozess einbezogen werden? ",null,null,null,null,null,null,null,"1. Welche Akteure sollen aktiv in den Erarbeitungsprozess einbezogen werden? ",null,null,null,null,null,null,null,"1. Welche Akteure sollen aktiv in den Erarbeitungsprozess einbezogen werden? ",null,null,null,null,null,null,null,"1. Welche Akteure sollen aktiv in den Erarbeitungsprozess einbezogen werden? ",null,null,null,null,null,null,null,"1. Welche Akteure sollen aktiv in den Erarbeitungsprozess einbezogen werden? ",null,null,null,null,null,null,null,"1. Welche Akteure sollen aktiv in den Erarbeitungsprozess einbezogen werden? ",null,null,null,null,null,null,null,"1. Welche Akteure sollen aktiv in den Erarbeitungsprozess einbezogen werden? ",null,null,null,null,null,null,null,"1. Welche Akteure sollen aktiv in den Erarbeitungsprozess einbezogen werden? ",null,null,null,null,null,null,null,"1. Welche Akteure sollen aktiv in den Erarbeitungsprozess einbezogen werden? ",null,null,null,null,null,null,null,"1. Welche Akteure sollen aktiv in den Erarbeitungsprozess einbezogen werden? ",null,null,null,null,null,null,null,"1. Welche Akteure sollen aktiv in den Erarbeitungsprozess einbezogen werden? ",null,null,null,null,null,null,null,"1. Welche Akteure sollen aktiv in den Erarbeitungsprozess einbezogen werden? ",null,null,null,null,null,null,null,"1. Welche Akteure sollen aktiv in den Erarbeitungsprozess einbezogen werden? ",null,null,null,null,null,null,null,"1. Welche Akteure sollen aktiv in den Erarbeitungsprozess einbezogen werden? ",null,null,null,null,null,null,null,"1. Welche Akteure sollen aktiv in den Erarbeitungsprozess einbezogen werden? ",null,null,null,null,null,null,null,"1. Welche Akteure sollen aktiv in den Erarbeitungsprozess einbezogen werden? ",null,null,null,null,null,null,null,"1. Welche Akteure sollen aktiv in den Erarbeitungsprozess einbezogen werden? ",null,null,null,null,null,null,null,"1. Welche Akteure sollen aktiv in den Erarbeitungsprozess einbezogen werden? ",null,null,null,null,null,null,null,"1. Welche Akteure sollen aktiv in den Erarbeitungsprozess einbezogen werden? ",null,null,null,null,null,null,null,"1. Welche Akteure sollen aktiv in den Erarbeitungsprozess einbezogen werden? ",null,null,null,null,null,null,null,"1. Welche Akteure sollen aktiv in den Erarbeitungsprozess einbezogen werden? ",null,null,null,null,null,null,null,"1. Welche Akteure sollen aktiv in den Erarbeitungsprozess einbezogen werden? ",null,null,null,null,null,null,null,"1. Welche Akteure sollen aktiv in den Erarbeitungsprozess einbezogen werden? ",null,null,null,null,null,null,null,"1. Welche Akteure sollen aktiv in den Erarbeitungsprozess einbezogen werden? ",null,null,null,null,null,null,null,"1. Welche Akteure sollen aktiv in den Erarbeitungsprozess einbezogen werden? ",null,null,null,null,null,null,null,"1. Welche Akteure sollen aktiv in den Erarbeitungsprozess einbezogen werden? ",null,null,null,null,null,null,null,"1. Welche Akteure sollen aktiv in den Erarbeitungsprozess einbezogen werden? ",null,null,null,null,null,null,null,"1. Welche Akteure sollen aktiv in den Erarbeitungsprozess einbezogen werden? ",null,null,null,null,null,null,null,"1. Welche Akteure sollen aktiv in den Erarbeitungsprozess einbezogen werden? ",null,null,null,null,null,null,null,"1. Welche Akteure sollen aktiv in den Erarbeitungsprozess einbezogen werden? ",null,null,null,null,null,null,null,"1. Welche Akteure sollen aktiv in den Erarbeitungsprozess einbezogen werden? ",null,null,null,null,null,null,null,"1. Welche Akteure sollen aktiv in den Erarbeitungsprozess einbezogen werden? ",null,null,null,null,null,null,null,"1. Welche Akteure sollen aktiv in den Erarbeitungsprozess einbezogen werden? ",null,null,null,null,null,null,null,"1. Welche Akteure sollen aktiv in den Erarbeitungsprozess einbezogen werden? ",null,null,null,null,null,null,null,"1. Welche Akteure sollen aktiv in den Erarbeitungsprozess einbezogen werden? ",null,null,null,null,null,null,null,"1. Welche Akteure sollen aktiv in den Erarbeitungsprozess einbezogen werden? ",null,null,null,null,null,null,null,"1. Welche Akteure sollen aktiv in den Erarbeitungsprozess einbezogen werden? ",null,null,null,null,null,null,null,"1. Welche Akteure sollen aktiv in den Erarbeitungsprozess einbezogen werden? ",null,null,null,null,null,null,null,"1. Welche Akteure sollen aktiv in den Erarbeitungsprozess einbezogen werden? ",null,null,null,null,null,null,null,"1. Welche Akteure sollen aktiv in den Erarbeitungsprozess einbezogen werden? ",null,null,null,null,null,null,null,"1. Welche Akteure sollen aktiv in den Erarbeitungsprozess einbezogen werden? ",null,null,null,null,null,null,null,"1. Welche Akteure sollen aktiv in den Erarbeitungsprozess einbezogen werden? ",null,null,null,null,null,null,null,"1. Welche Akteure sollen aktiv in den Erarbeitungsprozess einbezogen werden? ",null,null,null,null,null,null,null,"1. Welche Akteure sollen aktiv in den Erarbeitungsprozess einbezogen werden? ",null,null,null,null,null,null,null,"1. Welche Akteure sollen aktiv in den Erarbeitungsprozess einbezogen werden? ",null,null,null,null,null,null,null,"1. Welche Akteure sollen aktiv in den Erarbeitungsprozess einbezogen werden? ",null,null,null,null,null,null,null,"1. Welche Akteure sollen aktiv in den Erarbeitungsprozess einbezogen werden? ",null,null,null,null,null,null,null,"1. Welche Akteure sollen aktiv in den Erarbeitungsprozess einbezogen werden? ",null,null,null,null,null,null,null,"1. Welche Akteure sollen aktiv in den Erarbeitungsprozess einbezogen werden? ",null,null,null,null,null,null,null,"1. Welche Akteure sollen aktiv in den Erarbeitungsprozess einbezogen werden? ",null,null,null,null,null,null,null,"1. Welche Akteure sollen aktiv in den Erarbeitungsprozess einbezogen werden? ",null,null,null,null,null,null,null,"1. Welche Akteure sollen aktiv in den Erarbeitungsprozess einbezogen werden? ",null,null,null,null,null,null,null,"1. Welche Akteure sollen aktiv in den Erarbeitungsprozess einbezogen werden? ",null,null,null,null,null,null,null,"1. Welche Akteure sollen aktiv in den Erarbeitungsprozess einbezogen werden? ",null,null,null,null,null,null,null,"1. Welche Akteure sollen aktiv in den Erarbeitungsprozess einbezogen werden? ",null,null,null,null,null,null,null,"1. Welche Akteure sollen aktiv in den Erarbeitungsprozess einbezogen werden? ",null,null,null,null,null,null,null,"1. Welche Akteure sollen aktiv in den Erarbeitungsprozess einbezogen werden? ",null,null,null,null,null,null,null,"1. Welche Akteure sollen aktiv in den Erarbeitungsprozess einbezogen werden? ",null,null,null,null,null,null,null,"1. Welche Akteure sollen aktiv in den Erarbeitungsprozess einbezogen werden? ",null,null,null,null,null,null,null,"1. Welche Akteure sollen aktiv in den Erarbeitungsprozess einbezogen werden? ",null,null,null,null,null,null,null,"1. Welche Akteure sollen aktiv in den Erarbeitungsprozess einbezogen werden? ",null,null,null,null,null,null,null,"1. Welche Akteure sollen aktiv in den Erarbeitungsprozess einbezogen werden? ",null,null,null,null,null,null,null,"1. Welche Akteure sollen aktiv in den Erarbeitungsprozess einbezogen werden? ",null,null,null,null,null,null,null,"1. Welche Akteure sollen aktiv in den Erarbeitungsprozess einbezogen werden? ",null,null,null,null,null,null,null,"1. Welche Akteure sollen aktiv in den Erarbeitungsprozess einbezogen werden? ",null,null,null,null,null,null,null,"1. Welche Akteure sollen aktiv in den Erarbeitungsprozess einbezogen werden? ",null,null,null,null,null,null,null,"1. Welche Akteure sollen aktiv in den Erarbeitungsprozess einbezogen werden? ",null,null,null,null,null,null,null,"1. Welche Akteure sollen aktiv in den Erarbeitungsprozess einbezogen werden? ",null,null,null,null,null,null,null,"1. Welche Akteure sollen aktiv in den Erarbeitungsprozess einbezogen werden? ",null,null,null,null,null,null,null,"1. Welche Akteure sollen aktiv in den Erarbeitungsprozess einbezogen werden? ",null,null,null,null,null,null,null,"1. Welche Akteure sollen aktiv in den Erarbeitungsprozess einbezogen werden? ",null,null,null,null,null,null,null,"1. Welche Akteure sollen aktiv in den Erarbeitungsprozess einbezogen werden? ",null,null,null,null,null,null,null,"1. Welche Akteure sollen aktiv in den Erarbeitungsprozess einbezogen werden? ",null,null,null,null,null,null,null,"1. Welche Akteure sollen aktiv in den Erarbeitungsprozess einbezogen werden? ",null,null,null,null,null,null,null,"1. Welche Akteure sollen aktiv in den Erarbeitungsprozess einbezogen werden? ",null,null,null,null,null,null,null,"1. Welche Akteure sollen aktiv in den Erarbeitungsprozess einbezogen werden? ",null,null,null,null,null,null,null,"1. Welche Akteure sollen aktiv in den Erarbeitungsprozess einbezogen werden? ",null,null,null,null,null,null,null,"1. Welche Akteure sollen aktiv in den Erarbeitungsprozess einbezogen werden? ",null,null,null,null,null,null,null,"1. Welche Akteure sollen aktiv in den Erarbeitungsprozess einbezogen werden? ",null,null,null,null,null,null,null,"1. Welche Akteure sollen aktiv in den Erarbeitungsprozess einbezogen werden? ",null,null,null,null,null,null,null,"1. Welche Akteure sollen aktiv in den Erarbeitungsprozess einbezogen werden? ",null,null,null,null,null,null,null,"1. Welche Akteure sollen aktiv in den Erarbeitungsprozess einbezogen werden? ",null,null,null,null,null,null,null,"1. Welche Akteure sollen aktiv in den Erarbeitungsprozess einbezogen werden? ",null,null,null,null,null,null,null,"1. Welche Akteure sollen aktiv in den Erarbeitungsprozess einbezogen werden? ",null,null,null,null,null,null,null,"1. Welche Akteure sollen aktiv in den Erarbeitungsprozess einbezogen werden? ",null,null,null,null,null,null,null,"1. Welche Akteure sollen aktiv in den Erarbeitungsprozess einbezogen werden? ",null,null,null,null,null,null,null,"1. Welche Akteure sollen aktiv in den Erarbeitungsprozess einbezogen werden? ",null,null,null,null,null,null,null,"1. Welche Akteure sollen aktiv in den Erarbeitungsprozess einbezogen werden? ",null,null,null,null,null,null,null,"1. Welche Akteure sollen aktiv in den Erarbeitungsprozess einbezogen werden? ",null,null,null,null,null,null,null,"1. Welche Akteure sollen aktiv in den Erarbeitungsprozess einbezogen werden? ",null,null,null,null,null,null,null,"1. Welche Akteure sollen aktiv in den Erarbeitungsprozess einbezogen werden? ",null,null,null,null,null,null,null,"1. Welche Akteure sollen aktiv in den Erarbeitungsprozess einbezogen werden? ",null,null,null,null,null,null,null,"1. Welche Akteure sollen aktiv in den Erarbeitungsprozess einbezogen werden? ",null,null,null,null,null,null,null,"1. Welche Akteure sollen aktiv in den Erarbeitungsprozess einbezogen werden? ",null,null,null,null,null,null,null,"1. Welche Akteure sollen aktiv in den Erarbeitungsprozess einbezogen werden? ",null,null,null,null,null,null,null,"1. Welche Akteure sollen aktiv in den Erarbeitungsprozess einbezogen werden? ",null,null,null,null,null,null,null,"1. Welche Akteure sollen aktiv in den Erarbeitungsprozess einbezogen werden? ",null,null,null,null,null,null,null,"1. Welche Akteure sollen aktiv in den Erarbeitungsprozess einbezogen werden? ",null,null,null,null,null,null,null,"1. Welche Akteure sollen aktiv in den Erarbeitungsprozess einbezogen werden? ",null,null,null,null,null,null,null,"1. Welche Akteure sollen aktiv in den Erarbeitungsprozess einbezogen werden? ",null,null,null,null,null,null,null,"1. Welche Akteure sollen aktiv in den Erarbeitungsprozess einbezogen werden? ",null,null,null,null,null,null,null,"1. Welche Akteure sollen aktiv in den Erarbeitungsprozess einbezogen werden? ",null,null,null,null,null,null,null,"1. Welche Akteure sollen aktiv in den Erarbeitungsprozess einbezogen werden? ",null,null,null,null,null,null,null,"1. Welche Akteure sollen aktiv in den Erarbeitungsprozess einbezogen werden? ",null,null,null,null,null,null,null,"1. Welche Akteure sollen aktiv in den Erarbeitungsprozess einbezogen werden? ",null,null,null,null,null,null,null,"1. Welche Akteure sollen aktiv in den Erarbeitungsprozess einbezogen werden? ",null,null,null,null,null,null,null,"1. Welche Akteure sollen aktiv in den Erarbeitungsprozess einbezogen werden? ",null,null,null,null,null,null,null,"1. Welche Akteure sollen aktiv in den Erarbeitungsprozess einbezogen werden? ",null,null,null,null,null,null,null,"1. Welche Akteure sollen aktiv in den Erarbeitungsprozess einbezogen werden? ",null,null,null,null,null,null,null,"1. Welche Akteure sollen aktiv in den Erarbeitungsprozess einbezogen werden? ",null,null,null,null,null,null,null,"1. Welche Akteure sollen aktiv in den Erarbeitungsprozess einbezogen werden? ",null,null,null,null,null,null,null,"1. Welche Akteure sollen aktiv in den Erarbeitungsprozess einbezogen werden? ",null,null,null,null,null,null,null,"1. Welche Akteure sollen aktiv in den Erarbeitungsprozess einbezogen werden? ",null,null,null,null,null,null,null,"1. Welche Akteure sollen aktiv in den Erarbeitungsprozess einbezogen werden? ",null,null,null,null,null,null,null,"1. Welche Akteure sollen aktiv in den Erarbeitungsprozess einbezogen werden? ",null,null,null,null,null,null,null,"1. Welche Akteure sollen aktiv in den Erarbeitungsprozess einbezogen werden? ",null,null,null,null,null,null,null,"1. Welche Akteure sollen aktiv in den Erarbeitungsprozess einbezogen werden? ",null,null,null,null,null,null,null,"1. Welche Akteure sollen aktiv in den Erarbeitungsprozess einbezogen werden? ",null,null,null,null,null,null,null,"1. Welche Akteure sollen aktiv in den Erarbeitungsprozess einbezogen werden? ",null,null,null,null,null,null,null,"1. Welche Akteure sollen aktiv in den Erarbeitungsprozess einbezogen werden? ",null,null,null,null,null,null,null,"1. Welche Akteure sollen aktiv in den Erarbeitungsprozess einbezogen werden? ",null,null,null,null,null,null,null,"1. Welche Akteure sollen aktiv in den Erarbeitungsprozess einbezogen werden? ",null,null,null,null,null,null,null,"1. Welche Akteure sollen aktiv in den Erarbeitungsprozess einbezogen werden? ",null,null,null,null,null,null,null,"1. Welche Akteure sollen aktiv in den Erarbeitungsprozess einbezogen werden? ",null,null,null,null,null,null,null,"1. Welche Akteure sollen aktiv in den Erarbeitungsprozess einbezogen werden? ",null,null,null,null,null,null,null,"1. Welche Akteure sollen aktiv in den Erarbeitungsprozess einbezogen werden? ",null,null,null,null,null,null,null,"1. Welche Akteure sollen aktiv in den Erarbeitungsprozess einbezogen werden? ",null,null,null,null,null,null,null,"1. Welche Akteure sollen aktiv in den Erarbeitungsprozess einbezogen werden? ",null,null,null,null,null,null,null,"1. Welche Akteure sollen aktiv in den Erarbeitungsprozess einbezogen werden? ",null,null,null,null,null,null,null,"1. Welche Akteure sollen aktiv in den Erarbeitungsprozess einbezogen werden? ",null,null,null,null,null,null,null,"1. Welche Akteure sollen aktiv in den Erarbeitungsprozess einbezogen werden? ",null,null,null,null,null,null,null,"1. Welche Akteure sollen aktiv in den Erarbeitungsprozess einbezogen werden? ",null,null,null,null,null,null,null,"1. Welche Akteure sollen aktiv in den Erarbeitungsprozess einbezogen werden? ",null,null,null,null,null,null,null,"1. Welche Akteure sollen aktiv in den Erarbeitungsprozess einbezogen werden? ",null,null,null,null,null,null,null,"1. Welche Akteure sollen aktiv in den Erarbeitungsprozess einbezogen werden? ",null,null,null,null,null,null,null,"1. Welche Akteure sollen aktiv in den Erarbeitungsprozess einbezogen werden? ",null,null,null,null,null,null,null,"1. Welche Akteure sollen aktiv in den Erarbeitungsprozess einbezogen werden? ",null,null,null,null,null,null,null,"1. Welche Akteure sollen aktiv in den Erarbeitungsprozess einbezogen werden? ",null,null,null,null,null,null,null,"1. Welche Akteure sollen aktiv in den Erarbeitungsprozess einbezogen werden? ",null,null,null,null,null,null,null,"1. Welche Akteure sollen aktiv in den Erarbeitungsprozess einbezogen werden? ",null,null,null,null,null,null,null,"1. Welche Akteure sollen aktiv in den Erarbeitungsprozess einbezogen werden? ",null,null,null,null,null,null,null,"1. Welche Akteure sollen aktiv in den Erarbeitungsprozess einbezogen werden? ",null,null,null,null,null,null,null,"1. Welche Akteure sollen aktiv in den Erarbeitungsprozess einbezogen werden? ",null,null,null,null,null,null,null,"1. Welche Akteure sollen aktiv in den Erarbeitungsprozess einbezogen werden? ",null,null,null,null,null,null,null,"1. Welche Akteure sollen aktiv in den Erarbeitungsprozess einbezogen werden? ",null,null,null,null,null,null,null,"1. Welche Akteure sollen aktiv in den Erarbeitungsprozess einbezogen werden? ",null,null,null,null,null,null,null,"1. Welche Akteure sollen aktiv in den Erarbeitungsprozess einbezogen werden? ",null,null,null,null,null,null,null,"1. Welche Akteure sollen aktiv in den Erarbeitungsprozess einbezogen werden? ",null,null,null,null,null,null,null,"1. Welche Akteure sollen aktiv in den Erarbeitungsprozess einbezogen werden? ",null,null,null,null,null,null,null,"1. Welche Akteure sollen aktiv in den Erarbeitungsprozess einbezogen werden? ",null,null,null,null,null,null,null,"1. Welche Akteure sollen aktiv in den Erarbeitungsprozess einbezogen werden? ",null,null,null,null,null,null,null,"1. Welche Akteure sollen aktiv in den Erarbeitungsprozess einbezogen werden? ",null,null,null,null,null,null,null,"1. Welche Akteure sollen aktiv in den Erarbeitungsprozess einbezogen werden? ",null,null,null,null,null,null,null,"1. Welche Akteure sollen aktiv in den Erarbeitungsprozess einbezogen werden? ",null,null,null,null,null,null,null,"1. Welche Akteure sollen aktiv in den Erarbeitungsprozess einbezogen werden? ",null,null,null,null,null,null,null,"1. Welche Akteure sollen aktiv in den Erarbeitungsprozess einbezogen werden? ",null,null,null,null,null,null,null,"1. Welche Akteure sollen aktiv in den Erarbeitungsprozess einbezogen werden? ",null,null,null,null,null,null,null,"1. Welche Akteure sollen aktiv in den Erarbeitungsprozess einbezogen werden? ",null,null,null,null,null,null,null,"1. Welche Akteure sollen aktiv in den Erarbeitungsprozess einbezogen werden? ",null,null,null,null,null,null,null,"1. Welche Akteure sollen aktiv in den Erarbeitungsprozess einbezogen werden? ",null,null,null,null,null,null,null,"1. Welche Akteure sollen aktiv in den Erarbeitungsprozess einbezogen werden? ",null,null,null,null,null,null,null,"1. Welche Akteure sollen aktiv in den Erarbeitungsprozess einbezogen werden? ",null,null,null,null,null,null,null,"1. Welche Akteure sollen aktiv in den Erarbeitungsprozess einbezogen werden? ",null,null,null,null,null,null,null,"1. Welche Akteure sollen aktiv in den Erarbeitungsprozess einbezogen werden? ",null,null,null,null,null,null,null,"1. Welche Akteure sollen aktiv in den Erarbeitungsprozess einbezogen werden? ",null,null,null,null,null,null,null,"1. Welche Akteure sollen aktiv in den Erarbeitungsprozess einbezogen werden? ",null,null,null,null,null,null,null,"1. Welche Akteure sollen aktiv in den Erarbeitungsprozess einbezogen werden? ",null,null,null,null,null,null,null,"1. Welche Akteure sollen aktiv in den Erarbeitungsprozess einbezogen werden? ",null,null,null,null,null,null,null,"1. Welche Akteure sollen aktiv in den Erarbeitungsprozess einbezogen werden? ",null,null,null,null,null,null,null,"1. Welche Akteure sollen aktiv in den Erarbeitungsprozess einbezogen werden? ",null,null,null,null,null,null,null,"1. Welche Akteure sollen aktiv in den Erarbeitungsprozess einbezogen werden? ",null,null,null,null,null,null,null,"1. Welche Akteure sollen aktiv in den Erarbeitungsprozess einbezogen werden? ",null,null,null,null,null,null,null,"1. Welche Akteure sollen aktiv in den Erarbeitungsprozess einbezogen werden? ",null,null,null,null,null,null,null,"1. Welche Akteure sollen aktiv in den Erarbeitungsprozess einbezogen werden? ",null,null,null,null,null,null,null,"1. Welche Akteure sollen aktiv in den Erarbeitungsprozess einbezogen werden? ",null,null,null,null,null,null,null,"1. Welche Akteure sollen aktiv in den Erarbeitungsprozess einbezogen werden? ",null,null,null,null,null,null,null,"1. Welche Akteure sollen aktiv in den Erarbeitungsprozess einbezogen werden? ",null,null,null,null,null,null,null,"1. Welche Akteure sollen aktiv in den Erarbeitungsprozess einbezogen werden? ",null,null,null,null,null,null,null,"1. Welche Akteure sollen aktiv in den Erarbeitungsprozess einbezogen werden? ",null,null,null,null,null,null,null,"1. Welche Akteure sollen aktiv in den Erarbeitungsprozess einbezogen werden? ",null,null,null,null,null,null,null,"1. Welche Akteure sollen aktiv in den Erarbeitungsprozess einbezogen werden? ",null,null,null,null,null,null,null,"1. Welche Akteure sollen aktiv in den Erarbeitungsprozess einbezogen werden? ",null,null,null,null,null,null,null,"1. Welche Akteure sollen aktiv in den Erarbeitungsprozess einbezogen werden? ",null,null,null,null,null,null,null,"1. Welche Akteure sollen aktiv in den Erarbeitungsprozess einbezogen werden? ",null,null,null,null,null,null,null,"1. Welche Akteure sollen aktiv in den Erarbeitungsprozess einbezogen werden? ",null,null,null,null,null,null,null,"1. Welche Akteure sollen aktiv in den Erarbeitungsprozess einbezogen werden? ",null,null,null,null,null,null,null,"1. Welche Akteure sollen aktiv in den Erarbeitungsprozess einbezogen werden? ",null,null,null,null,null,null,null,"1. Welche Akteure sollen aktiv in den Erarbeitungsprozess einbezogen werden? ",null,null,null,null,null,null,null,"1. Welche Akteure sollen aktiv in den Erarbeitungsprozess einbezogen werden? ",null,null,null,null,null,null,null,"1. Welche Akteure sollen aktiv in den Erarbeitungsprozess einbezogen werden? ",null,null,null,null,null,null,null,"1. Welche Akteure sollen aktiv in den Erarbeitungsprozess einbezogen werden? ",null,null,null,null,null,null,null,"1. Welche Akteure sollen aktiv in den Erarbeitungsprozess einbezogen werden? ",null,null,null,null,null,null,null,"1. Welche Akteure sollen aktiv in den Erarbeitungsprozess einbezogen werden? ",null,null,null,null,null,null,null,"1. Welche Akteure sollen aktiv in den Erarbeitungsprozess einbezogen werden? ",null,null,null,null,null,null,null,"1. Welche Akteure sollen aktiv in den Erarbeitungsprozess einbezogen werden? ",null,null,null,null,null,null,null,"1. Welche Akteure sollen aktiv in den Erarbeitungsprozess einbezogen werden? ",null,null,null,null,null,null,null,"1. Welche Akteure sollen aktiv in den Erarbeitungsprozess einbezogen werden? ",null,null,null,null,null,null,null,"1. Welche Akteure sollen aktiv in den Erarbeitungsprozess einbezogen werden? ",null,null,null,null,null,null,null,"1. Welche Akteure sollen aktiv in den Erarbeitungsprozess einbezogen werden? ",null,null,null,null,null,null,null,"1. Welche Akteure sollen aktiv in den Erarbeitungsprozess einbezogen werden? ",null,null,null,null,null,null,null,"1. Welche Akteure sollen aktiv in den Erarbeitungsprozess einbezogen werden? ",null,null,null,null,null,null,null,"1. Welche Akteure sollen aktiv in den Erarbeitungsprozess einbezogen werden? ",null,null,null,null,null,null,null,"1. Welche Akteure sollen aktiv in den Erarbeitungsprozess einbezogen werden? ",null,null,null,null,null,null,null,"1. Welche Akteure sollen aktiv in den Erarbeitungsprozess einbezogen werden? ",null,null,null,null,null,null,null,"1. Welche Akteure sollen aktiv in den Erarbeitungsprozess einbezogen werden? ",null,null,null,null,null,null,null,"1. Welche Akteure sollen aktiv in den Erarbeitungsprozess einbezogen werden? ",null,null,null,null,null,null,null,"1. Welche Akteure sollen aktiv in den Erarbeitungsprozess einbezogen werden? ",null,null,null,null,null,null,null,"1. Welche Akteure sollen aktiv in den Erarbeitungsprozess einbezogen werden? ",null,null,null,null,null,null,null,"1. Welche Akteure sollen aktiv in den Erarbeitungsprozess einbezogen werden? ",null,null,null,null,null,null,null,"1. Welche Akteure sollen aktiv in den Erarbeitungsprozess einbezogen werden? ",null,null,null,null,null,null,null,"1. Welche Akteure sollen aktiv in den Erarbeitungsprozess einbezogen werden? ",null,null,null,null,null,null,null,"1. Welche Akteure sollen aktiv in den Erarbeitungsprozess einbezogen werden? ",null,null,null,null,null,null,null,"1. Welche Akteure sollen aktiv in den Erarbeitungsprozess einbezogen werden? ",null,null,null,null,null,null,null,"1. Welche Akteure sollen aktiv in den Erarbeitungsprozess einbezogen werden? ",null,null,null,null,null,null,null,"1. Welche Akteure sollen aktiv in den Erarbeitungsprozess einbezogen werden? ",null,null,null,null,null,null,null,"1. Welche Akteure sollen aktiv in den Erarbeitungsprozess einbezogen werden? ",null,null,null,null,null,null,null,"1. Welche Akteure sollen aktiv in den Erarbeitungsprozess einbezogen werden? ",null,null,null,null,null,null,null,"1. Welche Akteure sollen aktiv in den Erarbeitungsprozess einbezogen werden? ",null,null,null,null,null,null,null,"1. Welche Akteure sollen aktiv in den Erarbeitungsprozess einbezogen werden? ",null,null,null,null,null,null,null,"1. Welche Akteure sollen aktiv in den Erarbeitungsprozess einbezogen werden? ",null,null,null,null,null,null,null,"1. Welche Akteure sollen aktiv in den Erarbeitungsprozess einbezogen werden? ",null,null,null,null,null,null,null,"1. Welche Akteure sollen aktiv in den Erarbeitungsprozess einbezogen werden? ",null,null,null,null,null,null,null,"1. Welche Akteure sollen aktiv in den Erarbeitungsprozess einbezogen werden? ",null,null,null,null,null,null,null,"1. Welche Akteure sollen aktiv in den Erarbeitungsprozess einbezogen werden? ",null,null,null,null,null,null,null,"1. Welche Akteure sollen aktiv in den Erarbeitungsprozess einbezogen werden? ",null,null,null,null,null,null,null,"1. Welche Akteure sollen aktiv in den Erarbeitungsprozess einbezogen werden? ",null,null,null,null,null,null,null,"1. Welche Akteure sollen aktiv in den Erarbeitungsprozess einbezogen werden? ",null,null,null,null,null,null,null,"1. Welche Akteure sollen aktiv in den Erarbeitungsprozess einbezogen werden? ",null,null,null,null,null,null,null,"1. Welche Akteure sollen aktiv in den Erarbeitungsprozess einbezogen werden? ",null,null,null,null,null,null,null,"1. Welche Akteure sollen aktiv in den Erarbeitungsprozess einbezogen werden? ",null,null,null,null,null,null,null,"1. Welche Akteure sollen aktiv in den Erarbeitungsprozess einbezogen werden? ",null,null,null,null,null,null,null,"1. Welche Akteure sollen aktiv in den Erarbeitungsprozess einbezogen werden? ",null,null,null,null,null,null,null,"1. Welche Akteure sollen aktiv in den Erarbeitungsprozess einbezogen werden? ",null,null,null,null,null,null,null,"1. Welche Akteure sollen aktiv in den Erarbeitungsprozess einbezogen werden? ",null,null,null,null,null,null,null,"1. Welche Akteure sollen aktiv in den Erarbeitungsprozess einbezogen werden? ",null,null,null,null,null,null,null,"1. Welche Akteure sollen aktiv in den Erarbeitungsprozess einbezogen werden? ",null,null,null,null,null,null,null,"1. Welche Akteure sollen aktiv in den Erarbeitungsprozess einbezogen werden? ",null,null,null,null,null,null,null,"1. Welche Akteure sollen aktiv in den Erarbeitungsprozess einbezogen werden? ",null,null,null,null,null,null,null,"1. Welche Akteure sollen aktiv in den Erarbeitungsprozess einbezogen werden? ",null,null,null,null,null,null,null,"1. Welche Akteure sollen aktiv in den Erarbeitungsprozess einbezogen werden? ",null,null,null,null,null,null,null,"1. Welche Akteure sollen aktiv in den Erarbeitungsprozess einbezogen werden? ",null,null,null,null,null,null,null,"1. Welche Akteure sollen aktiv in den Erarbeitungsprozess einbezogen werden? ",null,null,null,null,null,null,null,"1. Welche Akteure sollen aktiv in den Erarbeitungsprozess einbezogen werden? ",null,null,null,null,null,null,null,"1. Welche Akteure sollen aktiv in den Erarbeitungsprozess einbezogen werden? ",null,null,null,null,null,null,null,"1. Welche Akteure sollen aktiv in den Erarbeitungsprozess einbezogen werden? ",null,null,null,null,null,null,null,"1. Welche Akteure sollen aktiv in den Erarbeitungsprozess einbezogen werden? ",null,null,null,null,null,null,null,"1. Welche Akteure sollen aktiv in den Erarbeitungsprozess einbezogen werden? ",null,null,null,null,null,null,null,"1. Welche Akteure sollen aktiv in den Erarbeitungsprozess einbezogen werden? ",null,null,null,null,null,null,null,"1. Welche Akteure sollen aktiv in den Erarbeitungsprozess einbezogen werden? ",null,null,null,null,null,null,null,"1. Welche Akteure sollen aktiv in den Erarbeitungsprozess einbezogen werden? ",null,null,null,null,null,null,null,"1. Welche Akteure sollen aktiv in den Erarbeitungsprozess einbezogen werden? ",null,null,null,null,null,null,null,"1. Welche Akteure sollen aktiv in den Erarbeitungsprozess einbezogen werden? ",null,null,null,null,null,null,null,"1. Welche Akteure sollen aktiv in den Erarbeitungsprozess einbezogen werden? ",null,null,null,null,null,null,null,"1. Welche Akteure sollen aktiv in den Erarbeitungsprozess einbezogen werden? ",null,null,null,null,null,null,null,"1. Welche Akteure sollen aktiv in den Erarbeitungsprozess einbezogen werden? ",null,null,null,null,null,null,null,"1. Welche Akteure sollen aktiv in den Erarbeitungsprozess einbezogen werden? ",null,null,null,null,null,null,null,"1. Welche Akteure sollen aktiv in den Erarbeitungsprozess einbezogen werden? ",null,null,null,null,null,null,null,"1. Welche Akteure sollen aktiv in den Erarbeitungsprozess einbezogen werden? ",null,null,null,null,null,null,null,"1. Welche Akteure sollen aktiv in den Erarbeitungsprozess einbezogen werden? ",null,null,null,null,null,null,null,"1. Welche Akteure sollen aktiv in den Erarbeitungsprozess einbezogen werden? ",null,null,null,null,null,null,null,"1. Welche Akteure sollen aktiv in den Erarbeitungsprozess einbezogen werden? ",null,null,null,null,null,null,null,"1. Welche Akteure sollen aktiv in den Erarbeitungsprozess einbezogen werden? ",null,null,null,null,null,null,null,"1. Welche Akteure sollen aktiv in den Erarbeitungsprozess einbezogen werden? ",null,null,null,null,null,null,null,"1. Welche Akteure sollen aktiv in den Erarbeitungsprozess einbezogen werden? ",null,null,null,null,null,null,null,"1. Welche Akteure sollen aktiv in den Erarbeitungsprozess einbezogen werden? ",null,null,null,null,null,null,null,"1. Welche Akteure sollen aktiv in den Erarbeitungsprozess einbezogen werden? ",null,null,null,null,null,null,null,"1. Welche Akteure sollen aktiv in den Erarbeitungsprozess einbezogen werden? ",null,null,null,null,null,null,null,"1. Welche Akteure sollen aktiv in den Erarbeitungsprozess einbezogen werden? ",null,null,null,null,null,null,null,"1. Welche Akteure sollen aktiv in den Erarbeitungsprozess einbezogen werden? ",null,null,null,null,null,null,null,"1. Welche Akteure sollen aktiv in den Erarbeitungsprozess einbezogen werden? ",null,null,null,null,null,null,null,"1. Welche Akteure sollen aktiv in den Erarbeitungsprozess einbezogen werden? ",null,null,null,null,null,null,null,"1. Welche Akteure sollen aktiv in den Erarbeitungsprozess einbezogen werden? ",null,null,null,null,null,null,null,"1. Welche Akteure sollen aktiv in den Erarbeitungsprozess einbezogen werden? ",null,null,null,null,null,null,null,"1. Welche Akteure sollen aktiv in den Erarbeitungsprozess einbezogen werden? ",null,null,null,null,null,null,null,"1. Welche Akteure sollen aktiv in den Erarbeitungsprozess einbezogen werden? ",null,null,null,null,null,null,null,"1. Welche Akteure sollen aktiv in den Erarbeitungsprozess einbezogen werden? ",null,null,null,null,null,null,null,"1. Welche Akteure sollen aktiv in den Erarbeitungsprozess einbezogen werden? ",null,null,null,null,null,null,null,"1. Welche Akteure sollen aktiv in den Erarbeitungsprozess einbezogen werden? ",null,null,null,null,null,null,null,"1. Welche Akteure sollen aktiv in den Erarbeitungsprozess einbezogen werden? ",null,null,null,null,null,null,null,"1. Welche Akteure sollen aktiv in den Erarbeitungsprozess einbezogen werden? ",null,null,null,null,null,null,null,"1. Welche Akteure sollen aktiv in den Erarbeitungsprozess einbezogen werden? ",null,null,null,null,null,null,null,"1. Welche Akteure sollen aktiv in den Erarbeitungsprozess einbezogen werden? ",null,null,null,null,null,null,null,"1. Welche Akteure sollen aktiv in den Erarbeitungsprozess einbezogen werden? ",null,null,null,null,null,null,null,"1. Welche Akteure sollen aktiv in den Erarbeitungsprozess einbezogen werden? ",null,null,null,null,null,null,null,"1. Welche Akteure sollen aktiv in den Erarbeitungsprozess einbezogen werden? ",null,null,null,null,null,null,null,"1. Welche Akteure sollen aktiv in den Erarbeitungsprozess einbezogen werden? ",null,null,null,null,null,null,null,"1. Welche Akteure sollen aktiv in den Erarbeitungsprozess einbezogen werden? ",null,null,null,null,null,null,null,"1. Welche Akteure sollen aktiv in den Erarbeitungsprozess einbezogen werden? ",null,null,null,null,null,null,null,"1. Welche Akteure sollen aktiv in den Erarbeitungsprozess einbezogen werden? ",null,null,null,null,null,null,null,"1. Welche Akteure sollen aktiv in den Erarbeitungsprozess einbezogen werden? ",null,null,null,null,null,null,null,"1. Welche Akteure sollen aktiv in den Erarbeitungsprozess einbezogen werden? ",null,null,null,null,null,null,null,"1. Welche Akteure sollen aktiv in den Erarbeitungsprozess einbezogen werden? ",null,null,null,null,null,null,null,"1. Welche Akteure sollen aktiv in den Erarbeitungsprozess einbezogen werden? ",null,null,null,null,null,null,null,"1. Welche Akteure sollen aktiv in den Erarbeitungsprozess einbezogen werden? ",null,null,null,null,null,null,null,"1. Welche Akteure sollen aktiv in den Erarbeitungsprozess einbezogen werden? ",null,null,null,null,null,null,null,"1. Welche Akteure sollen aktiv in den Erarbeitungsprozess einbezogen werden? ",null,null,null,null,null,null,null,"1. Welche Akteure sollen aktiv in den Erarbeitungsprozess einbezogen werden? ",null,null,null,null,null,null,null,"1. Welche Akteure sollen aktiv in den Erarbeitungsprozess einbezogen werden? ",null,null,null,null,null,null,null,"1. Welche Akteure sollen aktiv in den Erarbeitungsprozess einbezogen werden? ",null,null,null,null,null,null,null,"1. Welche Akteure sollen aktiv in den Erarbeitungsprozess einbezogen werden? ",null,null,null,null,null,null,null,"1. Welche Akteure sollen aktiv in den Erarbeitungsprozess einbezogen werden? ",null,null,null,null,null,null,null,"1. Welche Akteure sollen aktiv in den Erarbeitungsprozess einbezogen werden? ",null,null,null,null,null,null,null,"1. Welche Akteure sollen aktiv in den Erarbeitungsprozess einbezogen werden? ",null,null,null,null,null,null,null,"1. Welche Akteure sollen aktiv in den Erarbeitungsprozess einbezogen werden? ",null,null,null,null,null,null,null,"1. Welche Akteure sollen aktiv in den Erarbeitungsprozess einbezogen werden? ",null,null,null,null,null,null,null,"1. Welche Akteure sollen aktiv in den Erarbeitungsprozess einbezogen werden? ",null,null,null,null,null,null,null,"1. Welche Akteure sollen aktiv in den Erarbeitungsprozess einbezogen werden? ",null,null,null,null,null,null,null,"1. Welche Akteure sollen aktiv in den Erarbeitungsprozess einbezogen werden? ",null,null,null,null,null,null,null,"1. Welche Akteure sollen aktiv in den Erarbeitungsprozess einbezogen werden? ",null,null,null,null,null,null,null,"1. Welche Akteure sollen aktiv in den Erarbeitungsprozess einbezogen werden? ",null,null,null,null,null,null,null,"1. Welche Akteure sollen aktiv in den Erarbeitungsprozess einbezogen werden? ",null,null,null,null,null,null,null,"1. Welche Akteure sollen aktiv in den Erarbeitungsprozess einbezogen werden? ",null,null,null,null,null,null,null,"1. Welche Akteure sollen aktiv in den Erarbeitungsprozess einbezogen werden? ",null,null,null,null,null,null,null,"1. Welche Akteure sollen aktiv in den Erarbeitungsprozess einbezogen werden? ",null,null,null,null,null,null,null,"1. Welche Akteure sollen aktiv in den Erarbeitungsprozess einbezogen werden? ",null,null,null,null,null,null,null,"1. Welche Akteure sollen aktiv in den Erarbeitungsprozess einbezogen werden? ",null,null,null,null,null,null,null,"1. Welche Akteure sollen aktiv in den Erarbeitungsprozess einbezogen werden? ",null,null,null,null,null,null,null,"1. Welche Akteure sollen aktiv in den Erarbeitungsprozess einbezogen werden? ",null,null,null,null,null,null,null,"1. Welche Akteure sollen aktiv in den Erarbeitungsprozess einbezogen werden? ",null,null,null,null,null,null,null,"1. Welche Akteure sollen aktiv in den Erarbeitungsprozess einbezogen werden? ",null,null,null,null,null,null,null,"1. Welche Akteure sollen aktiv in den Erarbeitungsprozess einbezogen werden? ",null,null,null,null,null,null,null,"1. Welche Akteure sollen aktiv in den Erarbeitungsprozess einbezogen werden? ",null,null,null,null,null,null,null,"1. Welche Akteure sollen aktiv in den Erarbeitungsprozess einbezogen werden? ",null,null,null,null,null,null,null,"1. Welche Akteure sollen aktiv in den Erarbeitungsprozess einbezogen werden? ",null,null,null,null,null,null,null,"1. Welche Akteure sollen aktiv in den Erarbeitungsprozess einbezogen werden? ",null,null,null,null,null,null,null,"1. Welche Akteure sollen aktiv in den Erarbeitungsprozess einbezogen werden? ",null,null,null,null,null,null,null,"1. Welche Akteure sollen aktiv in den Erarbeitungsprozess einbezogen werden? ",null,null,null,null,null,null,null,"1. Welche Akteure sollen aktiv in den Erarbeitungsprozess einbezogen werden? ",null,null,null,null,null,null,null,"1. Welche Akteure sollen aktiv in den Erarbeitungsprozess einbezogen werden? ",null,null,null,null,null,null,null,"1. Welche Akteure sollen aktiv in den Erarbeitungsprozess einbezogen werden? ",null,null,null,null,null,null,null,"1. Welche Akteure sollen aktiv in den Erarbeitungsprozess einbezogen werden? ",null,null,null,null,null,null,null,"1. Welche Akteure sollen aktiv in den Erarbeitungsprozess einbezogen werden? ",null,null,null,null,null,null,null,"1. Welche Akteure sollen aktiv in den Erarbeitungsprozess einbezogen werden? ",null,null,null,null,null,null,null,"1. Welche Akteure sollen aktiv in den Erarbeitungsprozess einbezogen werden? ",null,null,null,null,null,null,null,"1. Welche Akteure sollen aktiv in den Erarbeitungsprozess einbezogen werden? ",null,null,null,null,null,null,null,"1. Welche Akteure sollen aktiv in den Erarbeitungsprozess einbezogen werden? ",null,null,null,null,null,null,null,"1. Welche Akteure sollen aktiv in den Erarbeitungsprozess einbezogen werden? ",null,null,null,null,null,null,null,"1. Welche Akteure sollen aktiv in den Erarbeitungsprozess einbezogen werden? ",null,null,null,null,null,null,null,"1. Welche Akteure sollen aktiv in den Erarbeitungsprozess einbezogen werden? ",null,null,null,null,null,null,null,"1. Welche Akteure sollen aktiv in den Erarbeitungsprozess einbezogen werden? ",null,null,null,null,null,null,null,"1. Welche Akteure sollen aktiv in den Erarbeitungsprozess einbezogen werden? ",null,null,null,null,null,null,null,"1. Welche Akteure sollen aktiv in den Erarbeitungsprozess einbezogen werden? ",null,null,null,null,null,null,null,"1. Welche Akteure sollen aktiv in den Erarbeitungsprozess einbezogen werden? ",null,null,null,null,null,null,null,"1. Welche Akteure sollen aktiv in den Erarbeitungsprozess einbezogen werden? ",null,null,null,null,null,null,null,"1. Welche Akteure sollen aktiv in den Erarbeitungsprozess einbezogen werden? ",null,null,null,null,null,null,null,"1. Welche Akteure sollen aktiv in den Erarbeitungsprozess einbezogen werden? ",null,null,null,null,null,null,null,"1. Welche Akteure sollen aktiv in den Erarbeitungsprozess einbezogen werden? ",null,null,null,null,null,null,null,"1. Welche Akteure sollen aktiv in den Erarbeitungsprozess einbezogen werden? ",null,null,null,null,null,null,null,"1. Welche Akteure sollen aktiv in den Erarbeitungsprozess einbezogen werden? ",null,null,null,null,null,null,null,"1. Welche Akteure sollen aktiv in den Erarbeitungsprozess einbezogen werden? ",null,null,null,null,null,null,null,"1. Welche Akteure sollen aktiv in den Erarbeitungsprozess einbezogen werden? ",null,null,null,null,null,null,null,"1. Welche Akteure sollen aktiv in den Erarbeitungsprozess einbezogen werden? ",null,null,null,null,null,null,null,"1. Welche Akteure sollen aktiv in den Erarbeitungsprozess einbezogen werden? ",null,null,null,null,null,null,null,"1. Welche Akteure sollen aktiv in den Erarbeitungsprozess einbezogen werden? ",null,null,null,null,null,null,null,"1. Welche Akteure sollen aktiv in den Erarbeitungsprozess einbezogen werden? ",null,null,null,null,null,null,null,"1. Welche Akteure sollen aktiv in den Erarbeitungsprozess einbezogen werden? ",null,null,null,null,null,null,null,"1. Welche Akteure sollen aktiv in den Erarbeitungsprozess einbezogen werden? ",null,null,null,null,null,null,null,"1. Welche Akteure sollen aktiv in den Erarbeitungsprozess einbezogen werden? ",null,null,null,null,null,null,null,"1. Welche Akteure sollen aktiv in den Erarbeitungsprozess einbezogen werden? ",null,null,null,null,null,null,null,"1. Welche Akteure sollen aktiv in den Erarbeitungsprozess einbezogen werden? ",null,null,null,null,null,null,null,"1. Welche Akteure sollen aktiv in den Erarbeitungsprozess einbezogen werden? ",null,null,null,null,null,null,null,"1. Welche Akteure sollen aktiv in den Erarbeitungsprozess einbezogen werden? ",null,null,null,null,null,null,null,"1. Welche Akteure sollen aktiv in den Erarbeitungsprozess einbezogen werden? ",null,null,null,null,null,null,null,"1. Welche Akteure sollen aktiv in den Erarbeitungsprozess einbezogen werden? ",null,null,null,null,null,null,null,"1. Welche Akteure sollen aktiv in den Erarbeitungsprozess einbezogen werden? ",null,null,null,null,null,null,null,"1. Welche Akteure sollen aktiv in den Erarbeitungsprozess einbezogen werden? ",null,null,null,null,null,null,null,"1. Welche Akteure sollen aktiv in den Erarbeitungsprozess einbezogen werden? ",null,null,null,null,null,null,null,"1. Welche Akteure sollen aktiv in den Erarbeitungsprozess einbezogen werden? ",null,null,null,null,null,null,null,"1. Welche Akteure sollen aktiv in den Erarbeitungsprozess einbezogen werden? ",null,null,null,null,null,null,null,"1. Welche Akteure sollen aktiv in den Erarbeitungsprozess einbezogen werden? ",null,null,null,null,null,null,null,"1. Welche Akteure sollen aktiv in den Erarbeitungsprozess einbezogen werden? ",null,null,null,null,null,null,null,"1. Welche Akteure sollen aktiv in den Erarbeitungsprozess einbezogen werden? ",null,null,null,null,null,null,null,"1. Welche Akteure sollen aktiv in den Erarbeitungsprozess einbezogen werden? ",null,null,null,null,null,null,null,"1. Welche Akteure sollen aktiv in den Erarbeitungsprozess einbezogen werden? ",null,null,null,null,null,null,null,"1. Welche Akteure sollen aktiv in den Erarbeitungsprozess einbezogen werden? ",null,null,null,null,null,null,null,"1. Welche Akteure sollen aktiv in den Erarbeitungsprozess einbezogen werden? ",null,null,null,null,null,null,null,"1. Welche Akteure sollen aktiv in den Erarbeitungsprozess einbezogen werden? ",null,null,null,null,null,null,null,"1. Welche Akteure sollen aktiv in den Erarbeitungsprozess einbezogen werden? ",null,null,null,null,null,null,null,"1. Welche Akteure sollen aktiv in den Erarbeitungsprozess einbezogen werden? ",null,null,null,null,null,null,null,"1. Welche Akteure sollen aktiv in den Erarbeitungsprozess einbezogen werden? ",null,null,null,null,null,null,null,"1. Welche Akteure sollen aktiv in den Erarbeitungsprozess einbezogen werden? ",null,null,null,null,null,null,null,"1. Welche Akteure sollen aktiv in den Erarbeitungsprozess einbezogen werden? ",null,null,null,null,null,null,null,"1. Welche Akteure sollen aktiv in den Erarbeitungsprozess einbezogen werden? ",null,null,null,null,null,null,null,"1. Welche Akteure sollen aktiv in den Erarbeitungsprozess einbezogen werden? ",null,null,null,null,null,null,null,"1. Welche Akteure sollen aktiv in den Erarbeitungsprozess einbezogen werden? ",null,null,null,null,null,null,null,"1. Welche Akteure sollen aktiv in den Erarbeitungsprozess einbezogen werden? ",null,null,null,null,null,null,null,"1. Welche Akteure sollen aktiv in den Erarbeitungsprozess einbezogen werden? ",null,null,null,null,null,null,null,"1. Welche Akteure sollen aktiv in den Erarbeitungsprozess einbezogen werden? ",null,null,null,null,null,null,null,"1. Welche Akteure sollen aktiv in den Erarbeitungsprozess einbezogen werden? ",null,null,null,null,null,null,null,"1. Welche Akteure sollen aktiv in den Erarbeitungsprozess einbezogen werden? ",null,null,null,null,null,null,null,"1. Welche Akteure sollen aktiv in den Erarbeitungsprozess einbezogen werden? ",null,null,null,null,null,null,null,"1. Welche Akteure sollen aktiv in den Erarbeitungsprozess einbezogen werden? ",null,null,null,null,null,null,null,"1. Welche Akteure sollen aktiv in den Erarbeitungsprozess einbezogen werden? ",null,null,null,null,null,null,null,"1. Welche Akteure sollen aktiv in den Erarbeitungsprozess einbezogen werden? ",null,null,null,null,null,null,null,"1. Welche Akteure sollen aktiv in den Erarbeitungsprozess einbezogen werden? ",null,null,null,null,null,null,null,"1. Welche Akteure sollen aktiv in den Erarbeitungsprozess einbezogen werden? ",null,null,null,null,null,null,null,"1. Welche Akteure sollen aktiv in den Erarbeitungsprozess einbezogen werden? ",null,null,null,null,null,null,null,"1. Welche Akteure sollen aktiv in den Erarbeitungsprozess einbezogen werden? ",null,null,null,null,null,null,null,"1. Welche Akteure sollen aktiv in den Erarbeitungsprozess einbezogen werden? ",null,null,null,null,null,null,null,"1. Welche Akteure sollen aktiv in den Erarbeitungsprozess einbezogen werden? ",null,null,null,null,null,null,null,"1. Welche Akteure sollen aktiv in den Erarbeitungsprozess einbezogen werden? ",null,null,null,null,null,null,null,"1. Welche Akteure sollen aktiv in den Erarbeitungsprozess einbezogen werden? ",null,null,null,null,null,null,null,"1. Welche Akteure sollen aktiv in den Erarbeitungsprozess einbezogen werden? ",null,null,null,null,null,null,null,"1. Welche Akteure sollen aktiv in den Erarbeitungsprozess einbezogen werden? ",null,null,null,null,null,null,null,"1. Welche Akteure sollen aktiv in den Erarbeitungsprozess einbezogen werden? ",null,null,null,null,null,null,null,"1. Welche Akteure sollen aktiv in den Erarbeitungsprozess einbezogen werden? ",null,null,null,null,null,null,null,"1. Welche Akteure sollen aktiv in den Erarbeitungsprozess einbezogen werden? ",null,null,null,null,null,null,null,"1. Welche Akteure sollen aktiv in den Erarbeitungsprozess einbezogen werden? ",null,null,null,null,null,null,null,"1. Welche Akteure sollen aktiv in den Erarbeitungsprozess einbezogen werden? ",null,null,null,null,null,null,null,"1. Welche Akteure sollen aktiv in den Erarbeitungsprozess einbezogen werden? ",null,null,null,null,null,null,null,"1. Welche Akteure sollen aktiv in den Erarbeitungsprozess einbezogen werden? ",null,null,null,null,null,null,null,"1. Welche Akteure sollen aktiv in den Erarbeitungsprozess einbezogen werden? ",null,null,null,null,null,null,null,"1. Welche Akteure sollen aktiv in den Erarbeitungsprozess einbezogen werden? ",null,null,null,null,null,null,null,"1. Welche Akteure sollen aktiv in den Erarbeitungsprozess einbezogen werden? ",null,null,null,null,null,null,null,"1. Welche Akteure sollen aktiv in den Erarbeitungsprozess einbezogen werden? ",null,null,null,null,null,null,null,"1. Welche Akteure sollen aktiv in den Erarbeitungsprozess einbezogen werden? ",null,null,null,null,null,null,null,"1. Welche Akteure sollen aktiv in den Erarbeitungsprozess einbezogen werden? ",null,null,null,null,null,null,null,"1. Welche Akteure sollen aktiv in den Erarbeitungsprozess einbezogen werden? ",null,null,null,null,null,null,null,"1. Welche Akteure sollen aktiv in den Erarbeitungsprozess einbezogen werden? ",null,null,null,null,null,null,null,"1. Welche Akteure sollen aktiv in den Erarbeitungsprozess einbezogen werden? ",null,null,null,null,null,null,null,"1. Welche Akteure sollen aktiv in den Erarbeitungsprozess einbezogen werden? ",null,null,null,null,null,null,null,"1. Welche Akteure sollen aktiv in den Erarbeitungsprozess einbezogen werden? ",null,null,null,null,null,null,null,"1. Welche Akteure sollen aktiv in den Erarbeitungsprozess einbezogen werden? ",null,null,null,null,null,null,null,"1. Welche Akteure sollen aktiv in den Erarbeitungsprozess einbezogen werden? ",null,null,null,null,null,null,null,"1. Welche Akteure sollen aktiv in den Erarbeitungsprozess einbezogen werden? ",null,null,null,null,null,null,null,"1. Welche Akteure sollen aktiv in den Erarbeitungsprozess einbezogen werden? ",null,null,null,null,null,null,null,"1. Welche Akteure sollen aktiv in den Erarbeitungsprozess einbezogen werden? ",null,null,null,null,null,null,null,"1. Welche Akteure sollen aktiv in den Erarbeitungsprozess einbezogen werden? ",null,null,null,null,null,null,null,"1. Welche Akteure sollen aktiv in den Erarbeitungsprozess einbezogen werden? ",null,null,null,null,null,null,null,"1. Welche Akteure sollen aktiv in den Erarbeitungsprozess einbezogen werden? ",null,null,null,null,null,null,null,"1. Welche Akteure sollen aktiv in den Erarbeitungsprozess einbezogen werden? ",null,null,null,null,null,null,null,"1. Welche Akteure sollen aktiv in den Erarbeitungsprozess einbezogen werden? ",null,null,null,null,null,null,null,"1. Welche Akteure sollen aktiv in den Erarbeitungsprozess einbezogen werden? ",null,null,null,null,null,null,null,"1. Welche Akteure sollen aktiv in den Erarbeitungsprozess einbezogen werden? ",null,null,null,null,null,null,null,"1. Welche Akteure sollen aktiv in den Erarbeitungsprozess einbezogen werden? ",null,null,null,null,null,null,null,"1. Welche Akteure sollen aktiv in den Erarbeitungsprozess einbezogen werden? ",null,null,null,null,null,null,null,"1. Welche Akteure sollen aktiv in den Erarbeitungsprozess einbezogen werden? ",null,null,null,null,null,null,null,"1. Welche Akteure sollen aktiv in den Erarbeitungsprozess einbezogen werden? ",null,null,null,null,null,null,null,"1. Welche Akteure sollen aktiv in den Erarbeitungsprozess einbezogen werden? ",null,null,null,null,null,null,null,"1. Welche Akteure sollen aktiv in den Erarbeitungsprozess einbezogen werden? ",null,null,null,null,null,null,null,"1. Welche Akteure sollen aktiv in den Erarbeitungsprozess einbezogen werden? ",null,null,null,null,null,null,null,"1. Welche Akteure sollen aktiv in den Erarbeitungsprozess einbezogen werden? ",null,null,null,null,null,null,null,"1. Welche Akteure sollen aktiv in den Erarbeitungsprozess einbezogen werden? ",null,null,null,null,null,null,null,"1. Welche Akteure sollen aktiv in den Erarbeitungsprozess einbezogen werden? ",null,null,null,null,null,null,null,"1. Welche Akteure sollen aktiv in den Erarbeitungsprozess einbezogen werden? ",null,null,null,null,null,null,null,"1. Welche Akteure sollen aktiv in den Erarbeitungsprozess einbezogen werden? ",null,null,null,null,null,null,null,"1. Welche Akteure sollen aktiv in den Erarbeitungsprozess einbezogen werden? ",null,null,null,null,null,null,null,"1. Welche Akteure sollen aktiv in den Erarbeitungsprozess einbezogen werden? ",null,null,null,null,null,null,null,"1. Welche Akteure sollen aktiv in den Erarbeitungsprozess einbezogen werden? ",null,null,null,null,null,null,null,"1. Welche Akteure sollen aktiv in den Erarbeitungsprozess einbezogen werden? ",null,null,null,null,null,null,null,"1. Welche Akteure sollen aktiv in den Erarbeitungsprozess einbezogen werden? ",null,null,null,null,null,null,null,"1. Welche Akteure sollen aktiv in den Erarbeitungsprozess einbezogen werden? ",null,null,null,null,null,null,null,"1. Welche Akteure sollen aktiv in den Erarbeitungsprozess einbezogen werden? ",null,null,null,null,null,null,null,"1. Welche Akteure sollen aktiv in den Erarbeitungsprozess einbezogen werden? ",null,null,null,null,null,null,null,"1. Welche Akteure sollen aktiv in den Erarbeitungsprozess einbezogen werden? ",null,null,null,null,null,null,null,"1. Welche Akteure sollen aktiv in den Erarbeitungsprozess einbezogen werden? ",null,null,null,null,null,null,null,"1. Welche Akteure sollen aktiv in den Erarbeitungsprozess einbezogen werden? ",null,null,null,null,null,null,null,"1. Welche Akteure sollen aktiv in den Erarbeitungsprozess einbezogen werden? ",null,null,null,null,null,null,null,"1. Welche Akteure sollen aktiv in den Erarbeitungsprozess einbezogen werden? ",null,null,null,null,null,null,null,"1. Welche Akteure sollen aktiv in den Erarbeitungsprozess einbezogen werden? ",null,null,null,null,null,null,null,"1. Welche Akteure sollen aktiv in den Erarbeitungsprozess einbezogen werden? ",null,null,null,null,null,null,null,"1. Welche Akteure sollen aktiv in den Erarbeitungsprozess einbezogen werden? ",null,null,null,null,null,null,null,"1. Welche Akteure sollen aktiv in den Erarbeitungsprozess einbezogen werden? ",null,null,null,null,null,null,null,"1. Welche Akteure sollen aktiv in den Erarbeitungsprozess einbezogen werden? ",null,null,null,null,null,null,null,"1. Welche Akteure sollen aktiv in den Erarbeitungsprozess einbezogen werden? ",null,null,null,null,null,null,null,"1. Welche Akteure sollen aktiv in den Erarbeitungsprozess einbezogen werden? ",null,null,null,null,null,null,null,"1. Welche Akteure sollen aktiv in den Erarbeitungsprozess einbezogen werden? ",null,null,null,null,null,null,null,"1. Welche Akteure sollen aktiv in den Erarbeitungsprozess einbezogen werden? ",null,null,null,null,null,null,null,"1. Welche Akteure sollen aktiv in den Erarbeitungsprozess einbezogen werden? ",null,null,null,null,null,null,null,"1. Welche Akteure sollen aktiv in den Erarbeitungsprozess einbezogen werden? ",null,null,null,null,null,null,null,"1. Welche Akteure sollen aktiv in den Erarbeitungsprozess einbezogen werden? ",null,null,null,null,null,null,null,"1. Welche Akteure sollen aktiv in den Erarbeitungsprozess einbezogen werden? ",null,null,null,null,null,null,null,"1. Welche Akteure sollen aktiv in den Erarbeitungsprozess einbezogen werden? ",null,null,null,null,null,null,null,"1. Welche Akteure sollen aktiv in den Erarbeitungsprozess einbezogen werden? ",null,null,null,null,null,null,null,"1. Welche Akteure sollen aktiv in den Erarbeitungsprozess einbezogen werden? ",null,null,null,null,null,null,null,"1. Welche Akteure sollen aktiv in den Erarbeitungsprozess einbezogen werden? ",null,null,null,null,null,null,null,"1. Welche Akteure sollen aktiv in den Erarbeitungsprozess einbezogen werden? ",null,null,null,null,null,null,null,"1. Welche Akteure sollen aktiv in den Erarbeitungsprozess einbezogen werden? ",null,null,null,null,null,null,null,"1. Welche Akteure sollen aktiv in den Erarbeitungsprozess einbezogen werden? ",null,null,null,null,null,null,null,"1. Welche Akteure sollen aktiv in den Erarbeitungsprozess einbezogen werden? ",null,null,null,null,null,null,null,"1. Welche Akteure sollen aktiv in den Erarbeitungsprozess einbezogen werden? ",null,null,null,null,null,null,null,"1. Welche Akteure sollen aktiv in den Erarbeitungsprozess einbezogen werden? ",null,null,null,null,null,null,null,"1. Welche Akteure sollen aktiv in den Erarbeitungsprozess einbezogen werden? ",null,null,null,null,null,null,null,"1. Welche Akteure sollen aktiv in den Erarbeitungsprozess einbezogen werden? ",null,null,null,null,null,null,null,"1. Welche Akteure sollen aktiv in den Erarbeitungsprozess einbezogen werden? ",null,null,null,null,null,null,null,"1. Welche Akteure sollen aktiv in den Erarbeitungsprozess einbezogen werden? ",null,null,null,null,null,null,null,"1. Welche Akteure sollen aktiv in den Erarbeitungsprozess einbezogen werden? ",null,null,null,null,null,null,null,"1. Welche Akteure sollen aktiv in den Erarbeitungsprozess einbezogen werden? ",null,null,null,null,null,null,null,"1. Welche Akteure sollen aktiv in den Erarbeitungsprozess einbezogen werden? ",null,null,null,null,null,null,null,"1. Welche Akteure sollen aktiv in den Erarbeitungsprozess einbezogen werden? ",null,null,null,null,null,null,null,"1. Welche Akteure sollen aktiv in den Erarbeitungsprozess einbezogen werden? ",null,null,null,null,null,null,null,"1. Welche Akteure sollen aktiv in den Erarbeitungsprozess einbezogen werden? ",null,null,null,null,null,null,null,"1. Welche Akteure sollen aktiv in den Erarbeitungsprozess einbezogen werden? ",null,null,null,null,null,null,null,"1. Welche Akteure sollen aktiv in den Erarbeitungsprozess einbezogen werden? ",null,null,null,null,null,null,null,"1. Welche Akteure sollen aktiv in den Erarbeitungsprozess einbezogen werden? ",null,null,null,null,null,null,null,"1. Welche Akteure sollen aktiv in den Erarbeitungsprozess einbezogen werden? ",null,null,null,null,null,null,null,"1. Welche Akteure sollen aktiv in den Erarbeitungsprozess einbezogen werden? ",null,null,null,null,null,null,null,"1. Welche Akteure sollen aktiv in den Erarbeitungsprozess einbezogen werden? ",null,null,null,null,null,null,null,"1. Welche Akteure sollen aktiv in den Erarbeitungsprozess einbezogen werden? ",null,null,null,null,null,null,null,"1. Welche Akteure sollen aktiv in den Erarbeitungsprozess einbezogen werden? ",null,null,null,null,null,null,null,"1. Welche Akteure sollen aktiv in den Erarbeitungsprozess einbezogen werden? ",null,null,null,null,null,null,null,"1. Welche Akteure sollen aktiv in den Erarbeitungsprozess einbezogen werden? ",null,null,null,null,null,null,null,"1. Welche Akteure sollen aktiv in den Erarbeitungsprozess einbezogen werden? ",null,null,null,null,null,null,null,"1. Welche Akteure sollen aktiv in den Erarbeitungsprozess einbezogen werden? ",null,null,null,null,null,null,null,"1. Welche Akteure sollen aktiv in den Erarbeitungsprozess einbezogen werden? ",null,null,null,null,null,null,null,"1. Welche Akteure sollen aktiv in den Erarbeitungsprozess einbezogen werden? ",null,null,null,null,null,null,null,"1. Welche Akteure sollen aktiv in den Erarbeitungsprozess einbezogen werden? ",null,null,null,null,null,null,null,"1. Welche Akteure sollen aktiv in den Erarbeitungsprozess einbezogen werden? ",null,null,null,null,null,null,null,"1. Welche Akteure sollen aktiv in den Erarbeitungsprozess einbezogen werden? ",null,null,null,null,null,null,null,"1. Welche Akteure sollen aktiv in den Erarbeitungsprozess einbezogen werden? ",null,null,null,null,null,null,null,"1. Welche Akteure sollen aktiv in den Erarbeitungsprozess einbezogen werden? ",null,null,null,null,null,null,null,"1. Welche Akteure sollen aktiv in den Erarbeitungsprozess einbezogen werden? ",null,null,null,null,null,null,null,"1. Welche Akteure sollen aktiv in den Erarbeitungsprozess einbezogen werden? ",null,null,null,null,null,null,null,"1. Welche Akteure sollen aktiv in den Erarbeitungsprozess einbezogen werden? ",null,null,null,null,null,null,null,"1. Welche Akteure sollen aktiv in den Erarbeitungsprozess einbezogen werden? ",null,null,null,null,null,null,null,"1. Welche Akteure sollen aktiv in den Erarbeitungsprozess einbezogen werden? ",null,null,null,null,null,null,null,"1. Welche Akteure sollen aktiv in den Erarbeitungsprozess einbezogen werden? ",null,null,null,null,null,null,null,"1. Welche Akteure sollen aktiv in den Erarbeitungsprozess einbezogen werden? ",null,null,null,null,null,null,null,"1. Welche Akteure sollen aktiv in den Erarbeitungsprozess einbezogen werden? ",null,null,null,null,null,null,null,"1. Welche Akteure sollen aktiv in den Erarbeitungsprozess einbezogen werden? ",null,null,null,null,null,null,null,"1. Welche Akteure sollen aktiv in den Erarbeitungsprozess einbezogen werden? ",null,null,null,null,null,null,null,"1. Welche Akteure sollen aktiv in den Erarbeitungsprozess einbezogen werden? ",null,null,null,null,null,null,null,"1. Welche Akteure sollen aktiv in den Erarbeitungsprozess einbezogen werden? ",null,null,null,null,null,null,null,"1. Welche Akteure sollen aktiv in den Erarbeitungsprozess einbezogen werden? ",null,null,null,null,null,null,null,"1. Welche Akteure sollen aktiv in den Erarbeitungsprozess einbezogen werden? ",null,null,null,null,null,null,null,"1. Welche Akteure sollen aktiv in den Erarbeitungsprozess einbezogen werden? ",null,null,null,null,null,null,null,"1. Welche Akteure sollen aktiv in den Erarbeitungsprozess einbezogen werden? ",null,null,null,null,null,null,null,"1. Welche Akteure sollen aktiv in den Erarbeitungsprozess einbezogen werden? ",null,null,null,null,null,null,null,"1. Welche Akteure sollen aktiv in den Erarbeitungsprozess einbezogen werden? ",null,null,null,null,null,null,null,"1. Welche Akteure sollen aktiv in den Erarbeitungsprozess einbezogen werden? ",null,null,null,null,null,null,null,"1. Welche Akteure sollen aktiv in den Erarbeitungsprozess einbezogen werden? ",null,null,null,null,null,null,null,"1. Welche Akteure sollen aktiv in den Erarbeitungsprozess einbezogen werden? ",null,null,null,null,null,null,null,"1. Welche Akteure sollen aktiv in den Erarbeitungsprozess einbezogen werden? ",null,null,null,null,null,null,null,"1. Welche Akteure sollen aktiv in den Erarbeitungsprozess einbezogen werden? ",null,null,null,null,null,null,null,"1. Welche Akteure sollen aktiv in den Erarbeitungsprozess einbezogen werden? ",null,null,null,null,null,null,null,"1. Welche Akteure sollen aktiv in den Erarbeitungsprozess einbezogen werden? ",null,null,null,null,null,null,null,"1. Welche Akteure sollen aktiv in den Erarbeitungsprozess einbezogen werden? ",null,null,null,null,null,null,null,"1. Welche Akteure sollen aktiv in den Erarbeitungsprozess einbezogen werden? ",null,null,null,null,null,null,null,"1. Welche Akteure sollen aktiv in den Erarbeitungsprozess einbezogen werden? ",null,null,null,null,null,null,null,"1. Welche Akteure sollen aktiv in den Erarbeitungsprozess einbezogen werden? ",null,null,null,null,null,null,null,"1. Welche Akteure sollen aktiv in den Erarbeitungsprozess einbezogen werden? ",null,null,null,null,null,null,null,"1. Welche Akteure sollen aktiv in den Erarbeitungsprozess einbezogen werden? ",null,null,null,null,null,null,null,"1. Welche Akteure sollen aktiv in den Erarbeitungsprozess einbezogen werden? ",null,null,null,null,null,null,null,"1. Welche Akteure sollen aktiv in den Erarbeitungsprozess einbezogen werden? ",null,null,null,null,null,null,null,"1. Welche Akteure sollen aktiv in den Erarbeitungsprozess einbezogen werden? ",null,null,null,null,null,null,null,"1. Welche Akteure sollen aktiv in den Erarbeitungsprozess einbezogen werden? ",null,null,null,null,null,null,null,"1. Welche Akteure sollen aktiv in den Erarbeitungsprozess einbezogen werden? ",null,null,null,null,null,null,null,"1. Welche Akteure sollen aktiv in den Erarbeitungsprozess einbezogen werden? ",null,null,null,null,null,null,null,"1. Welche Akteure sollen aktiv in den Erarbeitungsprozess einbezogen werden? ",null,null,null,null,null,null,null,"1. Welche Akteure sollen aktiv in den Erarbeitungsprozess einbezogen werden? ",null,null,null,null,null,null,null,"1. Welche Akteure sollen aktiv in den Erarbeitungsprozess einbezogen werden? ",null,null,null,null,null,null,null,"1. Welche Akteure sollen aktiv in den Erarbeitungsprozess einbezogen werden? ",null,null,null,null,null,null,null,"1. Welche Akteure sollen aktiv in den Erarbeitungsprozess einbezogen werden? ",null,null,null,null,null,null,null,"1. Welche Akteure sollen aktiv in den Erarbeitungsprozess einbezogen werden? ",null,null,null,null,null,null,null,"1. Welche Akteure sollen aktiv in den Erarbeitungsprozess einbezogen werden? ",null,null,null,null,null,null,null,"1. Welche Akteure sollen aktiv in den Erarbeitungsprozess einbezogen werden? ",null,null,null,null,null,null,null,"1. Welche Akteure sollen aktiv in den Erarbeitungsprozess einbezogen werden? ",null,null,null,null,null,null,null,"1. Welche Akteure sollen aktiv in den Erarbeitungsprozess einbezogen werden? ",null,null,null,null,null,null,null,"1. Welche Akteure sollen aktiv in den Erarbeitungsprozess einbezogen werden? ",null,null,null,null,null,null,null,"1. Welche Akteure sollen aktiv in den Erarbeitungsprozess einbezogen werden? ",null,null,null,null,null,null,null,"1. Welche Akteure sollen aktiv in den Erarbeitungsprozess einbezogen werden? ",null,null,null,null,null,null,null,"1. Welche Akteure sollen aktiv in den Erarbeitungsprozess einbezogen werden? ",null,null,null,null,null,null,null,"1. Welche Akteure sollen aktiv in den Erarbeitungsprozess einbezogen werden? ",null,null,null,null,null,null,null,"1. Welche Akteure sollen aktiv in den Erarbeitungsprozess einbezogen werden? ",null,null,null,null,null,null,null,"1. Welche Akteure sollen aktiv in den Erarbeitungsprozess einbezogen werden? ",null,null,null,null,null,null,null,"1. Welche Akteure sollen aktiv in den Erarbeitungsprozess einbezogen werden? ",null,null,null,null,null,null,null,"1. Welche Akteure sollen aktiv in den Erarbeitungsprozess einbezogen werden? ",null,null,null,null,null,null,null,"1. Welche Akteure sollen aktiv in den Erarbeitungsprozess einbezogen werden? ",null,null,null,null,null,null,null,"1. Welche Akteure sollen aktiv in den Erarbeitungsprozess einbezogen werden? ",null,null,null,null,null,null,null,"1. Welche Akteure sollen aktiv in den Erarbeitungsprozess einbezogen werden? ",null,null,null,null,null,null,null,"1. Welche Akteure sollen aktiv in den Erarbeitungsprozess einbezogen werden? ",null,null,null,null,null,null,null,"1. Welche Akteure sollen aktiv in den Erarbeitungsprozess einbezogen werden? ",null,null,null,null,null,null,null,"1. Welche Akteure sollen aktiv in den Erarbeitungsprozess einbezogen werden? ",null,null,null,null,null,null,null,"1. Welche Akteure sollen aktiv in den Erarbeitungsprozess einbezogen werden? ",null,null,null,null,null,null,null,"1. Welche Akteure sollen aktiv in den Erarbeitungsprozess einbezogen werden? ",null,null,null,null,null,null,null,"1. Welche Akteure sollen aktiv in den Erarbeitungsprozess einbezogen werden? ",null,null,null,null,null,null,null,"1. Welche Akteure sollen aktiv in den Erarbeitungsprozess einbezogen werden? ",null,null,null,null,null,null,null,"1. Welche Akteure sollen aktiv in den Erarbeitungsprozess einbezogen werden? ",null,null,null,null,null,null,null,"1. Welche Akteure sollen aktiv in den Erarbeitungsprozess einbezogen werden? ",null,null,null,null,null,null,null,"1. Welche Akteure sollen aktiv in den Erarbeitungsprozess einbezogen werden? ",null,null,null,null,null,null,null,"1. Welche Akteure sollen aktiv in den Erarbeitungsprozess einbezogen werden? ",null,null,null,null,null,null,null,"1. Welche Akteure sollen aktiv in den Erarbeitungsprozess einbezogen werden? ",null,null,null,null,null,null,null,"1. Welche Akteure sollen aktiv in den Erarbeitungsprozess einbezogen werden? ",null,null,null,null,null,null,null,"1. Welche Akteure sollen aktiv in den Erarbeitungsprozess einbezogen werden? ",null,null,null,null,null,null,null,"1. Welche Akteure sollen aktiv in den Erarbeitungsprozess einbezogen werden? ",null,null,null,null,null,null,null,"1. Welche Akteure sollen aktiv in den Erarbeitungsprozess einbezogen werden? ",null,null,null,null,null,null,null,"1. Welche Akteure sollen aktiv in den Erarbeitungsprozess einbezogen werden? ",null,null,null,null,null,null,null,"1. Welche Akteure sollen aktiv in den Erarbeitungsprozess einbezogen werden? ",null,null,null,null,null,null,null,"1. Welche Akteure sollen aktiv in den Erarbeitungsprozess einbezogen werden? ",null,null,null,null,null,null,null,"1. Welche Akteure sollen aktiv in den Erarbeitungsprozess einbezogen werden? ",null,null,null,null,null,null,null,"1. Welche Akteure sollen aktiv in den Erarbeitungsprozess einbezogen werden? ",null,null,null,null,null,null,null,"1. Welche Akteure sollen aktiv in den Erarbeitungsprozess einbezogen werden? ",null,null,null,null,null,null,null,"1. Welche Akteure sollen aktiv in den Erarbeitungsprozess einbezogen werden? ",null,null,null,null,null,null,null,"1. Welche Akteure sollen aktiv in den Erarbeitungsprozess einbezogen werden? ",null,null,null,null,null,null,null,"1. Welche Akteure sollen aktiv in den Erarbeitungsprozess einbezogen werden? ",null,null,null,null,null,null,null,"1. Welche Akteure sollen aktiv in den Erarbeitungsprozess einbezogen werden? ",null,null,null,null,null,null,null,"1. Welche Akteure sollen aktiv in den Erarbeitungsprozess einbezogen werden? ",null,null,null,null,null,null,null,"1. Welche Akteure sollen aktiv in den Erarbeitungsprozess einbezogen werden? ",null,null,null,null,null,null,null,"1. Welche Akteure sollen aktiv in den Erarbeitungsprozess einbezogen werden? ",null,null,null,null,null,null,null,"1. Welche Akteure sollen aktiv in den Erarbeitungsprozess einbezogen werden? ",null,null,null,null,null,null,null,"1. Welche Akteure sollen aktiv in den Erarbeitungsprozess einbezogen werden? ",null,null,null,null,null,null,null,"1. Welche Akteure sollen aktiv in den Erarbeitungsprozess einbezogen werden? ",null,null,null,null,null,null,null,"1. Welche Akteure sollen aktiv in den Erarbeitungsprozess einbezogen werden? ",null,null,null,null,null,null,null,"1. Welche Akteure sollen aktiv in den Erarbeitungsprozess einbezogen werden? ",null,null,null,null,null,null,null,"1. Welche Akteure sollen aktiv in den Erarbeitungsprozess einbezogen werden? ",null,null,null,null,null,null,null,"1. Welche Akteure sollen aktiv in den Erarbeitungsprozess einbezogen werden? ",null,null,null,null,null,null,null,"1. Welche Akteure sollen aktiv in den Erarbeitungsprozess einbezogen werden? ",null,null,null,null,null,null,null,"1. Welche Akteure sollen aktiv in den Erarbeitungsprozess einbezogen werden? ",null,null,null,null,null,null,null,"1. Welche Akteure sollen aktiv in den Erarbeitungsprozess einbezogen werden? ",null,null,null,null,null,null,null,"1. Welche Akteure sollen aktiv in den Erarbeitungsprozess einbezogen werden? ",null,null,null,null,null,null,null,"1. Welche Akteure sollen aktiv in den Erarbeitungsprozess einbezogen werden? ",null,null,null,null,null,null,null,"1. Welche Akteure sollen aktiv in den Erarbeitungsprozess einbezogen werden? ",null,null,null,null,null,null,null,"1. Welche Akteure sollen aktiv in den Erarbeitungsprozess einbezogen werden? ",null,null,null,null,null,null,null,"1. Welche Akteure sollen aktiv in den Erarbeitungsprozess einbezogen werden? ",null,null,null,null,null,null,null,"1. Welche Akteure sollen aktiv in den Erarbeitungsprozess einbezogen werden? ",null,null,null,null,null,null,null,"1. Welche Akteure sollen aktiv in den Erarbeitungsprozess einbezogen werden? ",null,null,null,null,null,null,null,"1. Welche Akteure sollen aktiv in den Erarbeitungsprozess einbezogen werden? ",null,null,null,null,null,null,null,"1. Welche Akteure sollen aktiv in den Erarbeitungsprozess einbezogen werden? ",null,null,null,null,null,null,null,"1. Welche Akteure sollen aktiv in den Erarbeitungsprozess einbezogen werden? ",null,null,null,null,null,null,null,"1. Welche Akteure sollen aktiv in den Erarbeitungsprozess einbezogen werden? ",null,null,null,null,null,null,null,"1. Welche Akteure sollen aktiv in den Erarbeitungsprozess einbezogen werden? ",null,null,null,null,null,null,null,"1. Welche Akteure sollen aktiv in den Erarbeitungsprozess einbezogen werden? ",null,null,null,null,null,null,null,"1. Welche Akteure sollen aktiv in den Erarbeitungsprozess einbezogen werden? ",null,null,null,null,null,null,null,"1. Welche Akteure sollen aktiv in den Erarbeitungsprozess einbezogen werden? ",null,null,null,null,null,null,null,"1. Welche Akteure sollen aktiv in den Erarbeitungsprozess einbezogen werden? ",null,null,null,null,null,null,null,"1. Welche Akteure sollen aktiv in den Erarbeitungsprozess einbezogen werden? ",null,null,null,null,null,null,null,"1. Welche Akteure sollen aktiv in den Erarbeitungsprozess einbezogen werden? ",null,null,null,null,null,null,null,"1. Welche Akteure sollen aktiv in den Erarbeitungsprozess einbezogen werden? ",null,null,null,null,null,null,null,"1. Welche Akteure sollen aktiv in den Erarbeitungsprozess einbezogen werden? ",null,null,null,null,null,null,null,"1. Welche Akteure sollen aktiv in den Erarbeitungsprozess einbezogen werden? ",null,null,null,null,null,null,null,"1. Welche Akteure sollen aktiv in den Erarbeitungsprozess einbezogen werden? ",null,null,null,null,null,null,null,"1. Welche Akteure sollen aktiv in den Erarbeitungsprozess einbezogen werden? ",null,null,null,null,null,null,null,"1. Welche Akteure sollen aktiv in den Erarbeitungsprozess einbezogen werden? ",null,null,null,null,null,null,null,"1. Welche Akteure sollen aktiv in den Erarbeitungsprozess einbezogen werden? ",null,null,null,null,null,null,null,"1. Welche Akteure sollen aktiv in den Erarbeitungsprozess einbezogen werden? ",null,null,null,null,null,null,null,"1. Welche Akteure sollen aktiv in den Erarbeitungsprozess einbezogen werden? ",null,null,null,null,null,null,null,"1. Welche Akteure sollen aktiv in den Erarbeitungsprozess einbezogen werden? ",null,null,null,null,null,null,null,"1. Welche Akteure sollen aktiv in den Erarbeitungsprozess einbezogen werden? ",null,null,null,null,null,null,null,"1. Welche Akteure sollen aktiv in den Erarbeitungsprozess einbezogen werden? ",null,null,null,null,null,null,null,"1. Welche Akteure sollen aktiv in den Erarbeitungsprozess einbezogen werden? ",null,null,null,null,null,null,null,"1. Welche Akteure sollen aktiv in den Erarbeitungsprozess einbezogen werden? ",null,null,null,null,null,null,null,"1. Welche Akteure sollen aktiv in den Erarbeitungsprozess einbezogen werden? ",null,null,null,null,null,null,null,"1. Welche Akteure sollen aktiv in den Erarbeitungsprozess einbezogen werden? ",null,null,null,null,null,null,null,"1. Welche Akteure sollen aktiv in den Erarbeitungsprozess einbezogen werden? ",null,null,null,null,null,null,null,"1. Welche Akteure sollen aktiv in den Erarbeitungsprozess einbezogen werden? ",null,null,null,null,null,null,null,"1. Welche Akteure sollen aktiv in den Erarbeitungsprozess einbezogen werden? ",null,null,null,null,null,null,null,"1. Welche Akteure sollen aktiv in den Erarbeitungsprozess einbezogen werden? ",null,null,null,null,null,null,null,"1. Welche Akteure sollen aktiv in den Erarbeitungsprozess einbezogen werden? ",null,null,null,null,null,null,null,"1. Welche Akteure sollen aktiv in den Erarbeitungsprozess einbezogen werden? ",null,null,null,null,null,null,null,"1. Welche Akteure sollen aktiv in den Erarbeitungsprozess einbezogen werden? ",null,null,null,null,null,null,null,"1. Welche Akteure sollen aktiv in den Erarbeitungsprozess einbezogen werden? ",null,null,null,null,null,null,null,"1. Welche Akteure sollen aktiv in den Erarbeitungsprozess einbezogen werden? ",null,null,null,null,null,null,null,"1. Welche Akteure sollen aktiv in den Erarbeitungsprozess einbezogen werden? ",null,null,null,null,null,null,null,"1. Welche Akteure sollen aktiv in den Erarbeitungsprozess einbezogen werden? ",null,null,null,null,null,null,null,"1. Welche Akteure sollen aktiv in den Erarbeitungsprozess einbezogen werden? ",null,null,null,null,null,null,null,"1. Welche Akteure sollen aktiv in den Erarbeitungsprozess einbezogen werden? ",null,null,null,null,null,null,null,"1. Welche Akteure sollen aktiv in den Erarbeitungsprozess einbezogen werden? ",null,null,null,null,null,null,null,"1. Welche Akteure sollen aktiv in den Erarbeitungsprozess einbezogen werden? ",null,null,null,null,null,null,null,"1. Welche Akteure sollen aktiv in den Erarbeitungsprozess einbezogen werden? ",null,null,null,null,null,null,null,"1. Welche Akteure sollen aktiv in den Erarbeitungsprozess einbezogen werden? ",null,null,null,null,null,null,null,"1. Welche Akteure sollen aktiv in den Erarbeitungsprozess einbezogen werden? ",null,null,null,null,null,null,null,"1. Welche Akteure sollen aktiv in den Erarbeitungsprozess einbezogen werden? ",null,null,null,null,null,null,null,"1. Welche Akteure sollen aktiv in den Erarbeitungsprozess einbezogen werden? ",null,null,null,null,null,null,null,"1. Welche Akteure sollen aktiv in den Erarbeitungsprozess einbezogen werden? ",null,null,null,null,null,null,null,"1. Welche Akteure sollen aktiv in den Erarbeitungsprozess einbezogen werden? ",null,null,null,null,null,null,null,"1. Welche Akteure sollen aktiv in den Erarbeitungsprozess einbezogen werden? ",null,null,null,null,null,null,null,"1. Welche Akteure sollen aktiv in den Erarbeitungsprozess einbezogen werden? ",null,null,null,null,null,null,null,"1. Welche Akteure sollen aktiv in den Erarbeitungsprozess einbezogen werden? ",null,null,null,null,null,null,null,"1. Welche Akteure sollen aktiv in den Erarbeitungsprozess einbezogen werden? ",null,null,null,null,null,null,null,"1. Welche Akteure sollen aktiv in den Erarbeitungsprozess einbezogen werden? ",null,null,null,null,null,null,null,"1. Welche Akteure sollen aktiv in den Erarbeitungsprozess einbezogen werden? ",null,null,null,null,null,null,null,"1. Welche Akteure sollen aktiv in den Erarbeitungsprozess einbezogen werden? ",null,null,null,null,null,null,null,"1. Welche Akteure sollen aktiv in den Erarbeitungsprozess einbezogen werden? ",null,null,null,null,null,null,null,"1. Welche Akteure sollen aktiv in den Erarbeitungsprozess einbezogen werden? ",null,null,null,null,null,null,null,"1. Welche Akteure sollen aktiv in den Erarbeitungsprozess einbezogen werden? ",null,null,null,null,null,null,null,"1. Welche Akteure sollen aktiv in den Erarbeitungsprozess einbezogen werden? ",null,null,null,null,null,null,null,"1. Welche Akteure sollen aktiv in den Erarbeitungsprozess einbezogen werden? ",null,null,null,null,null,null,null,"1. Welche Akteure sollen aktiv in den Erarbeitungsprozess einbezogen werden? ",null,null,null,null,null,null,null,"1. Welche Akteure sollen aktiv in den Erarbeitungsprozess einbezogen werden? ",null,null,null,null,null,null,null,"1. Welche Akteure sollen aktiv in den Erarbeitungsprozess einbezogen werden? ",null,null,null,null,null,null,null,"1. Welche Akteure sollen aktiv in den Erarbeitungsprozess einbezogen werden? ",null,null,null,null,null,null,null,"1. Welche Akteure sollen aktiv in den Erarbeitungsprozess einbezogen werden? ",null,null,null,null,null,null,null,"1. Welche Akteure sollen aktiv in den Erarbeitungsprozess einbezogen werden? ",null,null,null,null,null,null,null,"1. Welche Akteure sollen aktiv in den Erarbeitungsprozess einbezogen werden? ",null,null,null,null,null,null,null,"1. Welche Akteure sollen aktiv in den Erarbeitungsprozess einbezogen werden? ",null,null,null,null,null,null,null,"1. Welche Akteure sollen aktiv in den Erarbeitungsprozess einbezogen werden? ",null,null,null,null,null,null,null,"1. Welche Akteure sollen aktiv in den Erarbeitungsprozess einbezogen werden? ",null,null,null,null,null,null,null,"1. Welche Akteure sollen aktiv in den Erarbeitungsprozess einbezogen werden? ",null,null,null,null,null,null,null,"1. Welche Akteure sollen aktiv in den Erarbeitungsprozess einbezogen werden? ",null,null,null,null,null,null,null,"1. Welche Akteure sollen aktiv in den Erarbeitungsprozess einbezogen werden? ",null,null,null,null,null,null,null,"1. Welche Akteure sollen aktiv in den Erarbeitungsprozess einbezogen werden? ",null,null,null,null,null,null,null,"1. Welche Akteure sollen aktiv in den Erarbeitungsprozess einbezogen werden? ",null,null,null,null,null,null,null,"1. Welche Akteure sollen aktiv in den Erarbeitungsprozess einbezogen werden? ",null,null,null,null,null,null,null,"1. Welche Akteure sollen aktiv in den Erarbeitungsprozess einbezogen werden? ",null,null,null,null,null,null,null,"1. Welche Akteure sollen aktiv in den Erarbeitungsprozess einbezogen werden? ",null,null,null,null,null,null,null,"1. Welche Akteure sollen aktiv in den Erarbeitungsprozess einbezogen werden? ",null,null,null,null,null,null,null,"1. Welche Akteure sollen aktiv in den Erarbeitungsprozess einbezogen werden? ",null,null,null,null,null,null,null,"1. Welche Akteure sollen aktiv in den Erarbeitungsprozess einbezogen werden? ",null,null,null,null,null,null,null,"1. Welche Akteure sollen aktiv in den Erarbeitungsprozess einbezogen werden? ",null,null,null,null,null,null,null,"1. Welche Akteure sollen aktiv in den Erarbeitungsprozess einbezogen werden? ",null,null,null,null,null,null,null,"1. Welche Akteure sollen aktiv in den Erarbeitungsprozess einbezogen werden? ",null,null,null,null,null,null,null,"1. Welche Akteure sollen aktiv in den Erarbeitungsprozess einbezogen werden? ",null,null,null,null,null,null,null,"1. Welche Akteure sollen aktiv in den Erarbeitungsprozess einbezogen werden? ",null,null,null,null,null,null,null,"1. Welche Akteure sollen aktiv in den Erarbeitungsprozess einbezogen werden? ",null,null,null,null,null,null,null,"1. Welche Akteure sollen aktiv in den Erarbeitungsprozess einbezogen werden? ",null,null,null,null,null,null,null,"1. Welche Akteure sollen aktiv in den Erarbeitungsprozess einbezogen werden? ",null,null,null,null,null,null,null,"1. Welche Akteure sollen aktiv in den Erarbeitungsprozess einbezogen werden? ",null,null,null,null,null,null,null,"1. Welche Akteure sollen aktiv in den Erarbeitungsprozess einbezogen werden? ",null,null,null,null,null,null,null,"1. Welche Akteure sollen aktiv in den Erarbeitungsprozess einbezogen werden? ",null,null,null,null,null,null,null,"1. Welche Akteure sollen aktiv in den Erarbeitungsprozess einbezogen werden? ",null,null,null,null,null,null,null,"1. Welche Akteure sollen aktiv in den Erarbeitungsprozess einbezogen werden? ",null,null,null,null,null,null,null,"1. Welche Akteure sollen aktiv in den Erarbeitungsprozess einbezogen werden? ",null,null,null,null,null,null,null,"1. Welche Akteure sollen aktiv in den Erarbeitungsprozess einbezogen werden? ",null,null,null,null,null,null,null,"1. Welche Akteure sollen aktiv in den Erarbeitungsprozess einbezogen werden? ",null,null,null,null,null,null,null,"1. Welche Akteure sollen aktiv in den Erarbeitungsprozess einbezogen werden? ",null,null,null,null,null,null,null,"1. Welche Akteure sollen aktiv in den Erarbeitungsprozess einbezogen werden? ",null,null,null,null,null,null,null,"1. Welche Akteure sollen aktiv in den Erarbeitungsprozess einbezogen werden? ",null,null,null,null,null,null,null,"1. Welche Akteure sollen aktiv in den Erarbeitungsprozess einbezogen werden? ",null,null,null,null,null,null,null,"1. Welche Akteure sollen aktiv in den Erarbeitungsprozess einbezogen werden? ",null,null,null,null,null,null,null,"1. Welche Akteure sollen aktiv in den Erarbeitungsprozess einbezogen werden? ",null,null,null,null,null,null,null,"1. Welche Akteure sollen aktiv in den Erarbeitungsprozess einbezogen werden? ",null,null,null,null,null,null,null,"1. Welche Akteure sollen aktiv in den Erarbeitungsprozess einbezogen werden? ",null,null,null,null,null,null,null,"1. Welche Akteure sollen aktiv in den Erarbeitungsprozess einbezogen werden? ",null,null,null,null,null,null,null,"1. Welche Akteure sollen aktiv in den Erarbeitungsprozess einbezogen werden? ",null,null,null,null,null,null,null,"1. Welche Akteure sollen aktiv in den Erarbeitungsprozess einbezogen werden? ",null,null,null,null,null,null,null,"1. Welche Akteure sollen aktiv in den Erarbeitungsprozess einbezogen werden? ",null,null,null,null,null,null,null,"1. Welche Akteure sollen aktiv in den Erarbeitungsprozess einbezogen werden? ",null,null,null,null,null,null,null,"1. Welche Akteure sollen aktiv in den Erarbeitungsprozess einbezogen werden? ",null,null,null,null,null,null,null,"1. Welche Akteure sollen aktiv in den Erarbeitungsprozess einbezogen werden? ",null,null,null,null,null,null,null,"1. Welche Akteure sollen aktiv in den Erarbeitungsprozess einbezogen werden? ",null,null,null,null,null,null,null,"1. Welche Akteure sollen aktiv in den Erarbeitungsprozess einbezogen werden? ",null,null,null,null,null,null,null,"1. Welche Akteure sollen aktiv in den Erarbeitungsprozess einbezogen werden? ",null,null,null,null,null,null,null,"1. Welche Akteure sollen aktiv in den Erarbeitungsprozess einbezogen werden? ",null,null,null,null,null,null,null,"1. Welche Akteure sollen aktiv in den Erarbeitungsprozess einbezogen werden? ",null,null,null,null,null,null,null,"1. Welche Akteure sollen aktiv in den Erarbeitungsprozess einbezogen werden? ",null,null,null,null,null,null,null,"1. Welche Akteure sollen aktiv in den Erarbeitungsprozess einbezogen werden? ",null,null,null,null,null,null,null,"1. Welche Akteure sollen aktiv in den Erarbeitungsprozess einbezogen werden? ",null,null,null,null,null,null,null,"1. Welche Akteure sollen aktiv in den Erarbeitungsprozess einbezogen werden? ",null,null,null,null,null,null,null,"1. Welche Akteure sollen aktiv in den Erarbeitungsprozess einbezogen werden? ",null,null,null,null,null,null,null,"1. Welche Akteure sollen aktiv in den Erarbeitungsprozess einbezogen werden? ",null,null,null,null,null,null,null,"1. Welche Akteure sollen aktiv in den Erarbeitungsprozess einbezogen werden? ",null,null,null,null,null,null,null,"1. Welche Akteure sollen aktiv in den Erarbeitungsprozess einbezogen werden? ",null,null,null,null,null,null,null,"1. Welche Akteure sollen aktiv in den Erarbeitungsprozess einbezogen werden? ",null,null,null,null,null,null,null,"1. Welche Akteure sollen aktiv in den Erarbeitungsprozess einbezogen werden? ",null,null,null,null,null,null,null,"1. Welche Akteure sollen aktiv in den Erarbeitungsprozess einbezogen werden? ",null,null,null,null,null,null,null,"1. Welche Akteure sollen aktiv in den Erarbeitungsprozess einbezogen werden? ",null,null,null,null,null,null,null,"1. Welche Akteure sollen aktiv in den Erarbeitungsprozess einbezogen werden? ",null,null,null,null,null,null,null,"1. Welche Akteure sollen aktiv in den Erarbeitungsprozess einbezogen werden? ",null,null,null,null,null,null,null,"1. Welche Akteure sollen aktiv in den Erarbeitungsprozess einbezogen werden? ",null,null,null,null,null,null,null,"1. Welche Akteure sollen aktiv in den Erarbeitungsprozess einbezogen werden? ",null,null,null,null,null,null,null,"1. Welche Akteure sollen aktiv in den Erarbeitungsprozess einbezogen werden? ",null,null,null,null,null,null,null,"1. Welche Akteure sollen aktiv in den Erarbeitungsprozess einbezogen werden? ",null,null,null,null,null,null,null,"1. Welche Akteure sollen aktiv in den Erarbeitungsprozess einbezogen werden? ",null,null,null,null,null,null,null,"1. Welche Akteure sollen aktiv in den Erarbeitungsprozess einbezogen werden? ",null,null,null,null,null,null,null,"1. Welche Akteure sollen aktiv in den Erarbeitungsprozess einbezogen werden? ",null,null,null,null,null,null,null,"1. Welche Akteure sollen aktiv in den Erarbeitungsprozess einbezogen werden? ",null,null,null,null,null,null,null,"1. Welche Akteure sollen aktiv in den Erarbeitungsprozess einbezogen werden? ",null,null,null,null,null,null,null,"1. Welche Akteure sollen aktiv in den Erarbeitungsprozess einbezogen werden? ",null,null,null,null,null,null,null,"1. Welche Akteure sollen aktiv in den Erarbeitungsprozess einbezogen werden? ",null,null,null,null,null,null,null,"1. Welche Akteure sollen aktiv in den Erarbeitungsprozess einbezogen werden? ",null,null,null,null,null,null,null,"1. Welche Akteure sollen aktiv in den Erarbeitungsprozess einbezogen werden? ",null,null,null,null,null,null,null,"1. Welche Akteure sollen aktiv in den Erarbeitungsprozess einbezogen werden? ",null,null,null,null,null,null,null,"1. Welche Akteure sollen aktiv in den Erarbeitungsprozess einbezogen werden? ",null,null,null,null,null,null,null,"1. Welche Akteure sollen aktiv in den Erarbeitungsprozess einbezogen werden? ",null,null,null,null,null,null,null,"1. Welche Akteure sollen aktiv in den Erarbeitungsprozess einbezogen werden? ",null,null,null,null,null,null,null,"1. Welche Akteure sollen aktiv in den Erarbeitungsprozess einbezogen werden? ",null,null,null,null,null,null,null,"1. Welche Akteure sollen aktiv in den Erarbeitungsprozess einbezogen werden? ",null,null,null,null,null,null,null,"1. Welche Akteure sollen aktiv in den Erarbeitungsprozess einbezogen werden? ",null,null,null,null,null,null,null,"1. Welche Akteure sollen aktiv in den Erarbeitungsprozess einbezogen werden? ",null,null,null,null,null,null,null,"1. Welche Akteure sollen aktiv in den Erarbeitungsprozess einbezogen werden? ",null,null,null,null,null,null,null,"1. Welche Akteure sollen aktiv in den Erarbeitungsprozess einbezogen werden? ",null,null,null,null,null,null,null,"1. Welche Akteure sollen aktiv in den Erarbeitungsprozess einbezogen werden? ",null,null,null,null,null,null,null,"1. Welche Akteure sollen aktiv in den Erarbeitungsprozess einbezogen werden? ",null,null,null,null,null,null,null,"1. Welche Akteure sollen aktiv in den Erarbeitungsprozess einbezogen werden? ",null,null,null,null,null,null,null,"1. Welche Akteure sollen aktiv in den Erarbeitungsprozess einbezogen werden? ",null,null,null,null,null,null,null,"1. Welche Akteure sollen aktiv in den Erarbeitungsprozess einbezogen werden? ",null,null,null,null,null,null,null,"1. Welche Akteure sollen aktiv in den Erarbeitungsprozess einbezogen werden? ",null,null,null,null,null,null,null,"1. Welche Akteure sollen aktiv in den Erarbeitungsprozess einbezogen werden? ",null,null,null,null,null,null,null,"1. Welche Akteure sollen aktiv in den Erarbeitungsprozess einbezogen werden? ",null,null,null,null,null,null,null,"1. Welche Akteure sollen aktiv in den Erarbeitungsprozess einbezogen werden? ",null,null,null,null,null,null,null,"1. Welche Akteure sollen aktiv in den Erarbeitungsprozess einbezogen werden? ",null,null,null,null,null,null,null,"1. Welche Akteure sollen aktiv in den Erarbeitungsprozess einbezogen werden? ",null,null,null,null,null,null,null,"1. Welche Akteure sollen aktiv in den Erarbeitungsprozess einbezogen werden? ",null,null,null,null,null,null,null,"1. Welche Akteure sollen aktiv in den Erarbeitungsprozess einbezogen werden? ",null,null,null,null,null,null,null,"1. Welche Akteure sollen aktiv in den Erarbeitungsprozess einbezogen werden? ",null,null,null,null,null,null,null,"1. Welche Akteure sollen aktiv in den Erarbeitungsprozess einbezogen werden? ",null,null,null,null,null,null,null,"1. Welche Akteure sollen aktiv in den Erarbeitungsprozess einbezogen werden? ",null,null,null,null,null,null,null,"1. Welche Akteure sollen aktiv in den Erarbeitungsprozess einbezogen werden? ",null,null,null,null,null,null,null,"1. Welche Akteure sollen aktiv in den Erarbeitungsprozess einbezogen werden? ",null,null,null,null,null,null,null,"1. Welche Akteure sollen aktiv in den Erarbeitungsprozess einbezogen werden? ",null,null,null,null,null,null,null,"1. Welche Akteure sollen aktiv in den Erarbeitungsprozess einbezogen werden? ",null,null,null,null,null,null,null,"1. Welche Akteure sollen aktiv in den Erarbeitungsprozess einbezogen werden? ",null,null,null,null,null,null,null,"1. Welche Akteure sollen aktiv in den Erarbeitungsprozess einbezogen werden? ",null,null,null,null,null,null,null,"1. Welche Akteure sollen aktiv in den Erarbeitungsprozess einbezogen werden? ",null,null,null,null,null,null,null,"1. Welche Akteure sollen aktiv in den Erarbeitungsprozess einbezogen werden? ",null,null,null,null,null,null,null,"1. Welche Akteure sollen aktiv in den Erarbeitungsprozess einbezogen werden? ",null,null,null,null,null,null,null,"1. Welche Akteure sollen aktiv in den Erarbeitungsprozess einbezogen werden? ",null,null,null,null,null,null,null,"1. Welche Akteure sollen aktiv in den Erarbeitungsprozess einbezogen werden? ",null,null,null,null,null,null,null,"1. Welche Akteure sollen aktiv in den Erarbeitungsprozess einbezogen werden? ",null,null,null,null,null,null,null,"1. Welche Akteure sollen aktiv in den Erarbeitungsprozess einbezogen werden? ",null,null,null,null,null,null,null,"1. Welche Akteure sollen aktiv in den Erarbeitungsprozess einbezogen werden? ",null,null,null,null,null,null,null,"1. Welche Akteure sollen aktiv in den Erarbeitungsprozess einbezogen werden? ",null,null,null,null,null,null,null,"1. Welche Akteure sollen aktiv in den Erarbeitungsprozess einbezogen werden? ",null,null,null,null,null,null,null,"1. Welche Akteure sollen aktiv in den Erarbeitungsprozess einbezogen werden? ",null,null,null,null,null,null,null,"1. Welche Akteure sollen aktiv in den Erarbeitungsprozess einbezogen werden? ",null,null,null,null,null,null,null,"1. Welche Akteure sollen aktiv in den Erarbeitungsprozess einbezogen werden? ",null,null,null,null,null,null,null,"1. Welche Akteure sollen aktiv in den Erarbeitungsprozess einbezogen werden? ",null,null,null,null,null,null,null,"1. Welche Akteure sollen aktiv in den Erarbeitungsprozess einbezogen werden? ",null,null,null,null,null,null,null,"1. Welche Akteure sollen aktiv in den Erarbeitungsprozess einbezogen werden? ",null,null,null,null,null,null,null,"1. Welche Akteure sollen aktiv in den Erarbeitungsprozess einbezogen werden? ",null,null,null,null,null,null,null,"1. Welche Akteure sollen aktiv in den Erarbeitungsprozess einbezogen werden? ",null,null,null,null,null,null,null,"1. Welche Akteure sollen aktiv in den Erarbeitungsprozess einbezogen werden? ",null,null,null,null,null,null,null,"1. Welche Akteure sollen aktiv in den Erarbeitungsprozess einbezogen werden? ",null,null,null,null,null,null,null,"1. Welche Akteure sollen aktiv in den Erarbeitungsprozess einbezogen werden? ",null,null,null,null,null,null,null,"1. Welche Akteure sollen aktiv in den Erarbeitungsprozess einbezogen werden? ",null,null,null,null,null,null,null,"1. Welche Akteure sollen aktiv in den Erarbeitungsprozess einbezogen werden? ",null,null,null,null,null,null,null,"1. Welche Akteure sollen aktiv in den Erarbeitungsprozess einbezogen werden? ",null,null,null,null,null,null,null,"1. Welche Akteure sollen aktiv in den Erarbeitungsprozess einbezogen werden? ",null,null,null,null,null,null,null,"1. Welche Akteure sollen aktiv in den Erarbeitungsprozess einbezogen werden? ",null,null,null,null,null,null,null,"1. Welche Akteure sollen aktiv in den Erarbeitungsprozess einbezogen werden? ",null,null,null,null,null,null,null,"1. Welche Akteure sollen aktiv in den Erarbeitungsprozess einbezogen werden? ",null,null,null,null,null,null,null,"1. Welche Akteure sollen aktiv in den Erarbeitungsprozess einbezogen werden? ",null,null,null,null,null,null,null,"1. Welche Akteure sollen aktiv in den Erarbeitungsprozess einbezogen werden? ",null,null,null,null,null,null,null,"1. Welche Akteure sollen aktiv in den Erarbeitungsprozess einbezogen werden? ",null,null,null,null,null,null,null,"1. Welche Akteure sollen aktiv in den Erarbeitungsprozess einbezogen werden? ",null,null,null,null,null,null,null,"1. Welche Akteure sollen aktiv in den Erarbeitungsprozess einbezogen werden? ",null,null,null,null,null,null,null,"1. Welche Akteure sollen aktiv in den Erarbeitungsprozess einbezogen werden? ",null,null,null,null,null,null,null,"1. Welche Akteure sollen aktiv in den Erarbeitungsprozess einbezogen werden? ",null,null,null,null,null,null,null,"1. Welche Akteure sollen aktiv in den Erarbeitungsprozess einbezogen werden? ",null,null,null,null,null,null,null,"1. Welche Akteure sollen aktiv in den Erarbeitungsprozess einbezogen werden? ",null,null,null,null,null,null,null,"1. Welche Akteure sollen aktiv in den Erarbeitungsprozess einbezogen werden? ",null,null,null,null,null,null,null,"1. Welche Akteure sollen aktiv in den Erarbeitungsprozess einbezogen werden? ",null,null,null,null,null,null,null,"1. Welche Akteure sollen aktiv in den Erarbeitungsprozess einbezogen werden? ",null,null,null,null,null,null,null,"1. Welche Akteure sollen aktiv in den Erarbeitungsprozess einbezogen werden? ",null,null,null,null,null,null,null,"1. Welche Akteure sollen aktiv in den Erarbeitungsprozess einbezogen werden? ",null,null,null,null,null,null,null,"1. Welche Akteure sollen aktiv in den Erarbeitungsprozess einbezogen werden? ",null,null,null,null,null,null,null,"1. Welche Akteure sollen aktiv in den Erarbeitungsprozess einbezogen werden? ",null,null,null,null,null,null,null,"1. Welche Akteure sollen aktiv in den Erarbeitungsprozess einbezogen werden? ",null,null,null,null,null,null,null,"1. Welche Akteure sollen aktiv in den Erarbeitungsprozess einbezogen werden? ",null,null,null,null,null,null,null,"1. Welche Akteure sollen aktiv in den Erarbeitungsprozess einbezogen werden? ",null,null,null,null,null,null,null,"1. Welche Akteure sollen aktiv in den Erarbeitungsprozess einbezogen werden? ",null,null,null,null,null,null,null,"1. Welche Akteure sollen aktiv in den Erarbeitungsprozess einbezogen werden? ",null,null,null,null,null,null,null,"1. Welche Akteure sollen aktiv in den Erarbeitungsprozess einbezogen werden? ",null,null,null,null,null,null,null,"1. Welche Akteure sollen aktiv in den Erarbeitungsprozess einbezogen werden? ",null,null,null,null,null,null,null,"1. Welche Akteure sollen aktiv in den Erarbeitungsprozess einbezogen werden? ",null,null,null,null,null,null,null,"1. Welche Akteure sollen aktiv in den Erarbeitungsprozess einbezogen werden? ",null,null,null,null,null,null,null,"1. Welche Akteure sollen aktiv in den Erarbeitungsprozess einbezogen werden? ",null,null,null,null,null,null,null,"1. Welche Akteure sollen aktiv in den Erarbeitungsprozess einbezogen werden? ",null,null,null,null,null,null,null,"1. Welche Akteure sollen aktiv in den Erarbeitungsprozess einbezogen werden? ",null,null,null,null,null,null,null,"1. Welche Akteure sollen aktiv in den Erarbeitungsprozess einbezogen werden? ",null,null,null,null,null,null,null,"1. Welche Akteure sollen aktiv in den Erarbeitungsprozess einbezogen werden? ",null,null,null,null,null,null,null,"1. Welche Akteure sollen aktiv in den Erarbeitungsprozess einbezogen werden? ",null,null,null,null,null,null,null,"1. Welche Akteure sollen aktiv in den Erarbeitungsprozess einbezogen werden? ",null,null,null,null,null,null,null,"1. Welche Akteure sollen aktiv in den Erarbeitungsprozess einbezogen werden? ",null,null,null,null,null,null,null,"1. Welche Akteure sollen aktiv in den Erarbeitungsprozess einbezogen werden? ",null,null,null,null,null,null,null,"1. Welche Akteure sollen aktiv in den Erarbeitungsprozess einbezogen werden? ",null,null,null,null,null,null,null,"1. Welche Akteure sollen aktiv in den Erarbeitungsprozess einbezogen werden? ",null,null,null,null,null,null,null,"1. Welche Akteure sollen aktiv in den Erarbeitungsprozess einbezogen werden? ",null,null,null,null,null,null,null,"1. Welche Akteure sollen aktiv in den Erarbeitungsprozess einbezogen werden? ",null,null,null,null,null,null,null,"1. Welche Akteure sollen aktiv in den Erarbeitungsprozess einbezogen werden? ",null,null,null,null,null,null,null,"1. Welche Akteure sollen aktiv in den Erarbeitungsprozess einbezogen werden? ",null,null,null,null,null,null,null,"1. Welche Akteure sollen aktiv in den Erarbeitungsprozess einbezogen werden? ",null,null,null,null,null,null,null,"1. Welche Akteure sollen aktiv in den Erarbeitungsprozess einbezogen werden? ",null,null,null,null,null,null,null,"1. Welche Akteure sollen aktiv in den Erarbeitungsprozess einbezogen werden? ",null,null,null,null,null,null,null,"1. Welche Akteure sollen aktiv in den Erarbeitungsprozess einbezogen werden? ",null,null,null,null,null,null,null,"1. Welche Akteure sollen aktiv in den Erarbeitungsprozess einbezogen werden? ",null,null,null,null,null,null,null,"1. Welche Akteure sollen aktiv in den Erarbeitungsprozess einbezogen werden? ",null,null,null,null,null,null,null,"1. Welche Akteure sollen aktiv in den Erarbeitungsprozess einbezogen werden? ",null,null,null,null,null,null,null,"1. Welche Akteure sollen aktiv in den Erarbeitungsprozess einbezogen werden? ",null,null,null,null,null,null,null,"1. Welche Akteure sollen aktiv in den Erarbeitungsprozess einbezogen werden? ",null,null,null,null,null,null,null,"1. Welche Akteure sollen aktiv in den Erarbeitungsprozess einbezogen werden? ",null,null,null,null,null,null,null,"1. Welche Akteure sollen aktiv in den Erarbeitungsprozess einbezogen werden? ",null,null,null,null,null,null,null,"1. Welche Akteure sollen aktiv in den Erarbeitungsprozess einbezogen werden? ",null,null,null,null,null,null,null,"1. Welche Akteure sollen aktiv in den Erarbeitungsprozess einbezogen werden? ",null,null,null,null,null,null,null,"1. Welche Akteure sollen aktiv in den Erarbeitungsprozess einbezogen werden? ",null,null,null,null,null,null,null,"1. Welche Akteure sollen aktiv in den Erarbeitungsprozess einbezogen werden? ",null,null,null,null,null,null,null,"1. Welche Akteure sollen aktiv in den Erarbeitungsprozess einbezogen werden? ",null,null,null,null,null,null,null,"1. Welche Akteure sollen aktiv in den Erarbeitungsprozess einbezogen werden? ",null,null,null,null,null,null,null,"1. Welche Akteure sollen aktiv in den Erarbeitungsprozess einbezogen werden? ",null,null,null,null,null,null,null,"1. Welche Akteure sollen aktiv in den Erarbeitungsprozess einbezogen werden? ",null,null,null,null,null,null,null,"1. Welche Akteure sollen aktiv in den Erarbeitungsprozess einbezogen werden? ",null,null,null,null,null,null,null,"1. Welche Akteure sollen aktiv in den Erarbeitungsprozess einbezogen werden? ",null,null,null,null,null,null,null,"1. Welche Akteure sollen aktiv in den Erarbeitungsprozess einbezogen werden? ",null,null,null,null,null,null,null,"1. Welche Akteure sollen aktiv in den Erarbeitungsprozess einbezogen werden? ",null,null,null,null,null,null,null,"1. Welche Akteure sollen aktiv in den Erarbeitungsprozess einbezogen werden? ",null,null,null,null,null,null,null,"1. Welche Akteure sollen aktiv in den Erarbeitungsprozess einbezogen werden? ",null,null,null,null,null,null,null,"1. Welche Akteure sollen aktiv in den Erarbeitungsprozess einbezogen werden? ",null,null,null,null,null,null,null,"1. Welche Akteure sollen aktiv in den Erarbeitungsprozess einbezogen werden? ",null,null,null,null,null,null,null,"1. Welche Akteure sollen aktiv in den Erarbeitungsprozess einbezogen werden? ",null,null,null,null,null,null,null,"1. Welche Akteure sollen aktiv in den Erarbeitungsprozess einbezogen werden? ",null,null,null,null,null,null,null,"1. Welche Akteure sollen aktiv in den Erarbeitungsprozess einbezogen werden? ",null,null,null,null,null,null,null,"1. Welche Akteure sollen aktiv in den Erarbeitungsprozess einbezogen werden? ",null,null,null,null,null,null,null,"1. Welche Akteure sollen aktiv in den Erarbeitungsprozess einbezogen werden? ",null,null,null,null,null,null,null,"1. Welche Akteure sollen aktiv in den Erarbeitungsprozess einbezogen werden? ",null,null,null,null,null,null,null,"1. Welche Akteure sollen aktiv in den Erarbeitungsprozess einbezogen werden? ",null,null,null,null,null,null,null,"1. Welche Akteure sollen aktiv in den Erarbeitungsprozess einbezogen werden? ",null,null,null,null,null,null,null,"1. Welche Akteure sollen aktiv in den Erarbeitungsprozess einbezogen werden? ",null,null,null,null,null,null,null,"1. Welche Akteure sollen aktiv in den Erarbeitungsprozess einbezogen werden? ",null,null,null,null,null,null,null,"1. Welche Akteure sollen aktiv in den Erarbeitungsprozess einbezogen werden? ",null,null,null,null,null,null,null,"1. Welche Akteure sollen aktiv in den Erarbeitungsprozess einbezogen werden? ",null,null,null,null,null,null,null,"1. Welche Akteure sollen aktiv in den Erarbeitungsprozess einbezogen werden? ",null,null,null,null,null,null,null,"1. Welche Akteure sollen aktiv in den Erarbeitungsprozess einbezogen werden? ",null,null,null,null,null,null,null,"1. Welche Akteure sollen aktiv in den Erarbeitungsprozess einbezogen werden? ",null,null,null,null,null,null,null,"1. Welche Akteure sollen aktiv in den Erarbeitungsprozess einbezogen werden? ",null,null,null,null,null,null,null,"1. Welche Akteure sollen aktiv in den Erarbeitungsprozess einbezogen werden? ",null,null,null,null,null,null,null,"1. Welche Akteure sollen aktiv in den Erarbeitungsprozess einbezogen werden? ",null,null,null,null,null,null,null,"1. Welche Akteure sollen aktiv in den Erarbeitungsprozess einbezogen werden? ",null,null,null,null,null,null,null,"1. Welche Akteure sollen aktiv in den Erarbeitungsprozess einbezogen werden? ",null,null,null,null,null,null,null,"1. Welche Akteure sollen aktiv in den Erarbeitungsprozess einbezogen werden? ",null,null,null,null,null,null,null,"1. Welche Akteure sollen aktiv in den Erarbeitungsprozess einbezogen werden? ",null,null,null,null,null,null,null,"1. Welche Akteure sollen aktiv in den Erarbeitungsprozess einbezogen werden? ",null,null,null,null,null,null,null,"1. Welche Akteure sollen aktiv in den Erarbeitungsprozess einbezogen werden? ",null,null,null,null,null,null,null,"1. Welche Akteure sollen aktiv in den Erarbeitungsprozess einbezogen werden? ",null,null,null,null,null,null,null,"1. Welche Akteure sollen aktiv in den Erarbeitungsprozess einbezogen werden? ",null,null,null,null,null,null,null,"1. Welche Akteure sollen aktiv in den Erarbeitungsprozess einbezogen werden? ",null,null,null,null,null,null,null,"1. Welche Akteure sollen aktiv in den Erarbeitungsprozess einbezogen werden? ",null,null,null,null,null,null,null,"1. Welche Akteure sollen aktiv in den Erarbeitungsprozess einbezogen werden? ",null,null,null,null,null,null,null,"1. Welche Akteure sollen aktiv in den Erarbeitungsprozess einbezogen werden? ",null,null,null,null,null,null,null,"1. Welche Akteure sollen aktiv in den Erarbeitungsprozess einbezogen werden? ",null,null,null,null,null,null,null,"1. Welche Akteure sollen aktiv in den Erarbeitungsprozess einbezogen werden? ",null,null,null,null,null,null,null,"1. Welche Akteure sollen aktiv in den Erarbeitungsprozess einbezogen werden? ",null,null,null,null,null,null,null,"1. Welche Akteure sollen aktiv in den Erarbeitungsprozess einbezogen werden? ",null,null,null,null,null,null,null,"1. Welche Akteure sollen aktiv in den Erarbeitungsprozess einbezogen werden? ",null,null,null,null,null,null,null,"1. Welche Akteure sollen aktiv in den Erarbeitungsprozess einbezogen werden? ",null,null,null,null,null,null,null,"1. Welche Akteure sollen aktiv in den Erarbeitungsprozess einbezogen werden? ",null,null,null,null,null,null,null,"1. Welche Akteure sollen aktiv in den Erarbeitungsprozess einbezogen werden? ",null,null,null,null,null,null,null,"1. Welche Akteure sollen aktiv in den Erarbeitungsprozess einbezogen werden? ",null,null,null,null,null,null,null,"1. Welche Akteure sollen aktiv in den Erarbeitungsprozess einbezogen werden? ",null,null,null,null,null,null,null,"1. Welche Akteure sollen aktiv in den Erarbeitungsprozess einbezogen werden? ",null,null,null,null,null,null,null,"1. Welche Akteure sollen aktiv in den Erarbeitungsprozess einbezogen werden? ",null,null,null,null,null,null,null,"1. Welche Akteure sollen aktiv in den Erarbeitungsprozess einbezogen werden? ",null,null,null,null,null,null,null,"1. Welche Akteure sollen aktiv in den Erarbeitungsprozess einbezogen werden? ",null,null,null,null,null,null,null,"1. Welche Akteure sollen aktiv in den Erarbeitungsprozess einbezogen werden? ",null,null,null,null,null,null,null,"1. Welche Akteure sollen aktiv in den Erarbeitungsprozess einbezogen werden? ",null,null,null,null,null,null,null,"1. Welche Akteure sollen aktiv in den Erarbeitungsprozess einbezogen werden? ",null,null,null,null,null,null,null,"1. Welche Akteure sollen aktiv in den Erarbeitungsprozess einbezogen werden? ",null,null,null,null,null,null,null,"1. Welche Akteure sollen aktiv in den Erarbeitungsprozess einbezogen werden? ",null,null,null,null,null,null,null,"1. Welche Akteure sollen aktiv in den Erarbeitungsprozess einbezogen werden? ",null,null,null,null,null,null,null,"1. Welche Akteure sollen aktiv in den Erarbeitungsprozess einbezogen werden? ",null,null,null,null,null,null,null,"1. Welche Akteure sollen aktiv in den Erarbeitungsprozess einbezogen werden? ",null,null,null,null,null,null,null,"1. Welche Akteure sollen aktiv in den Erarbeitungsprozess einbezogen werden? ",null,null,null,null,null,null,null,"1. Welche Akteure sollen aktiv in den Erarbeitungsprozess einbezogen werden? ",null,null,null,null,null,null,null,"1. Welche Akteure sollen aktiv in den Erarbeitungsprozess einbezogen werden? ",null,null,null,null,null,null,null,"1. Welche Akteure sollen aktiv in den Erarbeitungsprozess einbezogen werden? ",null,null,null,null,null,null,null,"1. Welche Akteure sollen aktiv in den Erarbeitungsprozess einbezogen werden? ",null,null,null,null,null,null,null,"1. Welche Akteure sollen aktiv in den Erarbeitungsprozess einbezogen werden? ",null,null,null,null,null,null,null,"1. Welche Akteure sollen aktiv in den Erarbeitungsprozess einbezogen werden? ",null,null,null,null,null,null,null,"1. Welche Akteure sollen aktiv in den Erarbeitungsprozess einbezogen werden? ",null,null,null,null,null,null,null,"1. Welche Akteure sollen aktiv in den Erarbeitungsprozess einbezogen werden? ",null,null,null,null,null,null,null,"1. Welche Akteure sollen aktiv in den Erarbeitungsprozess einbezogen werden? ",null,null,null,null,null,null,null,"1. Welche Akteure sollen aktiv in den Erarbeitungsprozess einbezogen werden? ",null,null,null,null,null,null,null,"1. Welche Akteure sollen aktiv in den Erarbeitungsprozess einbezogen werden? ",null,null,null,null,null,null,null,"1. Welche Akteure sollen aktiv in den Erarbeitungsprozess einbezogen werden? ",null,null,null,null,null,null,null,"1. Welche Akteure sollen aktiv in den Erarbeitungsprozess einbezogen werden? ",null,null,null,null,null,null,null,"1. Welche Akteure sollen aktiv in den Erarbeitungsprozess einbezogen werden? ",null,null,null,null,null,null,null,"1. Welche Akteure sollen aktiv in den Erarbeitungsprozess einbezogen werden? ",null,null,null,null,null,null,null,"1. Welche Akteure sollen aktiv in den Erarbeitungsprozess einbezogen werden? ",null,null,null,null,null,null,null,"1. Welche Akteure sollen aktiv in den Erarbeitungsprozess einbezogen werden? ",null,null,null,null,null,null,null,"1. Welche Akteure sollen aktiv in den Erarbeitungsprozess einbezogen werden? ",null,null,null,null,null,null,null,"1. Welche Akteure sollen aktiv in den Erarbeitungsprozess einbezogen werden? ",null,null,null,null,null,null,null,"1. Welche Akteure sollen aktiv in den Erarbeitungsprozess einbezogen werden? ",null,null,null,null,null,null,null,"1. Welche Akteure sollen aktiv in den Erarbeitungsprozess einbezogen werden? ",null,null,null,null,null,null,null,"1. Welche Akteure sollen aktiv in den Erarbeitungsprozess einbezogen werden? ",null,null,null,null,null,null,null,"1. Welche Akteure sollen aktiv in den Erarbeitungsprozess einbezogen werden? ",null,null,null,null,null,null,null,"1. Welche Akteure sollen aktiv in den Erarbeitungsprozess einbezogen werden? ",null,null,null,null,null,null,null,"1. Welche Akteure sollen aktiv in den Erarbeitungsprozess einbezogen werden? ",null,null,null,null,null,null,null,"1. Welche Akteure sollen aktiv in den Erarbeitungsprozess einbezogen werden? ",null,null,null,null,null,null,null,"1. Welche Akteure sollen aktiv in den Erarbeitungsprozess einbezogen werden? ",null,null,null,null,null,null,null,"1. Welche Akteure sollen aktiv in den Erarbeitungsprozess einbezogen werden? ",null,null,null,null,null,null,null,"1. Welche Akteure sollen aktiv in den Erarbeitungsprozess einbezogen werden? ",null,null,null,null,null,null,null,"1. Welche Akteure sollen aktiv in den Erarbeitungsprozess einbezogen werden? ",null,null,null,null,null,null,null,"1. Welche Akteure sollen aktiv in den Erarbeitungsprozess einbezogen werden? ",null,null,null,null,null,null,null,"1. Welche Akteure sollen aktiv in den Erarbeitungsprozess einbezogen werden? ",null,null,null,null,null,null,null,"1. Welche Akteure sollen aktiv in den Erarbeitungsprozess einbezogen werden? ",null,null,null,null,null,null,null,"1. Welche Akteure sollen aktiv in den Erarbeitungsprozess einbezogen werden? ",null,null,null,null,null,null,null,"1. Welche Akteure sollen aktiv in den Erarbeitungsprozess einbezogen werden? ",null,null,null,null,null,null,null,"1. Welche Akteure sollen aktiv in den Erarbeitungsprozess einbezogen werden? ",null,null,null,null,null,null,null,"1. Welche Akteure sollen aktiv in den Erarbeitungsprozess einbezogen werden? ",null,null,null,null,null,null,null,"1. Welche Akteure sollen aktiv in den Erarbeitungsprozess einbezogen werden? ",null,null,null,null,null,null,null,"1. Welche Akteure sollen aktiv in den Erarbeitungsprozess einbezogen werden? ",null,null,null,null,null,null,null,"1. Welche Akteure sollen aktiv in den Erarbeitungsprozess einbezogen werden? ",null,null,null,null,null,null,null,"1. Welche Akteure sollen aktiv in den Erarbeitungsprozess einbezogen werden? ",null,null,null,null,null,null,null,"1. Welche Akteure sollen aktiv in den Erarbeitungsprozess einbezogen werden? ",null,null,null,null,null,null,null,"1. Welche Akteure sollen aktiv in den Erarbeitungsprozess einbezogen werden? ",null,null,null,null,null,null,null,"1. Welche Akteure sollen aktiv in den Erarbeitungsprozess einbezogen werden? ",null,null,null,null,null,null,null,"1. Welche Akteure sollen aktiv in den Erarbeitungsprozess einbezogen werden? ",null,null,null,null,null,null,null,"1. Welche Akteure sollen aktiv in den Erarbeitungsprozess einbezogen werden? ",null,null,null,null,null,null,null,"1. Welche Akteure sollen aktiv in den Erarbeitungsprozess einbezogen werden? ",null,null,null,null,null,null,null,"1. Welche Akteure sollen aktiv in den Erarbeitungsprozess einbezogen werden? ",null,null,null,null,null,null,null,"1. Welche Akteure sollen aktiv in den Erarbeitungsprozess einbezogen werden? ",null,null,null,null,null,null,null,"1. Welche Akteure sollen aktiv in den Erarbeitungsprozess einbezogen werden? ",null,null,null,null,null,null,null,"1. Welche Akteure sollen aktiv in den Erarbeitungsprozess einbezogen werden? ",null,null,null,null,null,null,null,"1. Welche Akteure sollen aktiv in den Erarbeitungsprozess einbezogen werden? ",null,null,null,null,null,null,null,"1. Welche Akteure sollen aktiv in den Erarbeitungsprozess einbezogen werden? ",null,null,null,null,null,null,null,"1. Welche Akteure sollen aktiv in den Erarbeitungsprozess einbezogen werden? ",null,null,null,null,null,null,null,"1. Welche Akteure sollen aktiv in den Erarbeitungsprozess einbezogen werden? ",null,null,null,null,null,null,null,"1. Welche Akteure sollen aktiv in den Erarbeitungsprozess einbezogen werden? ",null,null,null,null,null,null,null,"1. Welche Akteure sollen aktiv in den Erarbeitungsprozess einbezogen werden? ",null,null,null,null,null,null,null,"1. Welche Akteure sollen aktiv in den Erarbeitungsprozess einbezogen werden? ",null,null,null,null,null,null,null,"1. Welche Akteure sollen aktiv in den Erarbeitungsprozess einbezogen werden? ",null,null,null,null,null,null,null,"1. Welche Akteure sollen aktiv in den Erarbeitungsprozess einbezogen werden? ",null,null,null,null,null,null,null,"1. Welche Akteure sollen aktiv in den Erarbeitungsprozess einbezogen werden? ",null,null,null,null,null,null,null,"1. Welche Akteure sollen aktiv in den Erarbeitungsprozess einbezogen werden? ",null,null,null,null,null,null,null,"1. Welche Akteure sollen aktiv in den Erarbeitungsprozess einbezogen werden? ",null,null,null,null,null,null,null,"1. Welche Akteure sollen aktiv in den Erarbeitungsprozess einbezogen werden? ",null,null,null,null,null,null,null,"1. Welche Akteure sollen aktiv in den Erarbeitungsprozess einbezogen werden? ",null,null,null,null,null,null,null,"1. Welche Akteure sollen aktiv in den Erarbeitungsprozess einbezogen werden? ",null,null,null,null,null,null,null,"1. Welche Akteure sollen aktiv in den Erarbeitungsprozess einbezogen werden? ",null,null,null,null,null,null,null,"1. Welche Akteure sollen aktiv in den Erarbeitungsprozess einbezogen werden? ",null,null,null,null,null,null,null,"1. Welche Akteure sollen aktiv in den Erarbeitungsprozess einbezogen werden? ",null,null,null,null,null,null,null,"1. Welche Akteure sollen aktiv in den Erarbeitungsprozess einbezogen werden? ",null,null,null,null,null,null,null,"1. Welche Akteure sollen aktiv in den Erarbeitungsprozess einbezogen werden? ",null,null,null,null,null,null,null,"1. Welche Akteure sollen aktiv in den Erarbeitungsprozess einbezogen werden? ",null,null,null,null,null,null,null,"1. Welche Akteure sollen aktiv in den Erarbeitungsprozess einbezogen werden? ",null,null,null,null,null,null,null,"1. Welche Akteure sollen aktiv in den Erarbeitungsprozess einbezogen werden? ",null,null,null,null,null,null,null,"1. Welche Akteure sollen aktiv in den Erarbeitungsprozess einbezogen werden? ",null,null,null,null,null,null,null,"1. Welche Akteure sollen aktiv in den Erarbeitungsprozess einbezogen werden? ",null,null,null,null,null,null,null,"1. Welche Akteure sollen aktiv in den Erarbeitungsprozess einbezogen werden? ",null,null,null,null,null,null,null,"1. Welche Akteure sollen aktiv in den Erarbeitungsprozess einbezogen werden? ",null,null,null,null,null,null,null,"1. Welche Akteure sollen aktiv in den Erarbeitungsprozess einbezogen werden? ",null,null,null,null,null,null,null,"1. Welche Akteure sollen aktiv in den Erarbeitungsprozess einbezogen werden? ",null,null,null,null,null,null,null,"1. Welche Akteure sollen aktiv in den Erarbeitungsprozess einbezogen werden? ",null,null,null,null,null,null,null,"1. Welche Akteure sollen aktiv in den Erarbeitungsprozess einbezogen werden? ",null,null,null,null,null,null,null,"1. Welche Akteure sollen aktiv in den Erarbeitungsprozess einbezogen werden? ",null,null,null,null,null,null,null,"1. Welche Akteure sollen aktiv in den Erarbeitungsprozess einbezogen werden? ",null,null,null,null,null,null,null,"1. Welche Akteure sollen aktiv in den Erarbeitungsprozess einbezogen werden? ",null,null,null,null,null,null,null,"1. Welche Akteure sollen aktiv in den Erarbeitungsprozess einbezogen werden? ",null,null,null,null,null,null,null,"1. Welche Akteure sollen aktiv in den Erarbeitungsprozess einbezogen werden? ",null,null,null,null,null,null,null,"1. Welche Akteure sollen aktiv in den Erarbeitungsprozess einbezogen werden? ",null,null,null,null,null,null,null,"1. Welche Akteure sollen aktiv in den Erarbeitungsprozess einbezogen werden? ",null,null,null,null,null,null,null,"1. Welche Akteure sollen aktiv in den Erarbeitungsprozess einbezogen werden? ",null,null,null,null,null,null,null,"1. Welche Akteure sollen aktiv in den Erarbeitungsprozess einbezogen werden? ",null,null,null,null,null,null,null,"1. Welche Akteure sollen aktiv in den Erarbeitungsprozess einbezogen werden? ",null,null,null,null,null,null,null,"1. Welche Akteure sollen aktiv in den Erarbeitungsprozess einbezogen werden? ",null,null,null,null,null,null,null,"1. Welche Akteure sollen aktiv in den Erarbeitungsprozess einbezogen werden? ",null,null,null,null,null,null,null,"1. Welche Akteure sollen aktiv in den Erarbeitungsprozess einbezogen werden? ",null,null,null,null,null,null,null,"1. Welche Akteure sollen aktiv in den Erarbeitungsprozess einbezogen werden? ",null,null,null,null,null,null,null,"1. Welche Akteure sollen aktiv in den Erarbeitungsprozess einbezogen werden? ",null,null,null,null,null,null,null,"1. Welche Akteure sollen aktiv in den Erarbeitungsprozess einbezogen werden? ",null,null,null,null,null,null,null,"1. Welche Akteure sollen aktiv in den Erarbeitungsprozess einbezogen werden? ",null,null,null,null,null,null,null,"1. Welche Akteure sollen aktiv in den Erarbeitungsprozess einbezogen werden? ",null,null,null,null,null,null,null,"1. Welche Akteure sollen aktiv in den Erarbeitungsprozess einbezogen werden? ",null,null,null,null,null,null,null,"1. Welche Akteure sollen aktiv in den Erarbeitungsprozess einbezogen werden? ",null,null,null,null,null,null,null,"1. Welche Akteure sollen aktiv in den Erarbeitungsprozess einbezogen werden? ",null,null,null,null,null,null,null,"1. Welche Akteure sollen aktiv in den Erarbeitungsprozess einbezogen werden? ",null,null,null,null,null,null,null,"1. Welche Akteure sollen aktiv in den Erarbeitungsprozess einbezogen werden? ",null,null,null,null,null,null,null,"1. Welche Akteure sollen aktiv in den Erarbeitungsprozess einbezogen werden? ",null,null,null,null,null,null,null,"1. Welche Akteure sollen aktiv in den Erarbeitungsprozess einbezogen werden? ",null,null,null,null,null,null,null,"1. Welche Akteure sollen aktiv in den Erarbeitungsprozess einbezogen werden? ",null,null,null,null,null,null,null,"1. Welche Akteure sollen aktiv in den Erarbeitungsprozess einbezogen werden? ",null,null,null,null,null,null,null,"1. Welche Akteure sollen aktiv in den Erarbeitungsprozess einbezogen werden? ",null,null,null,null,null,null,null,"1. Welche Akteure sollen aktiv in den Erarbeitungsprozess einbezogen werden? ",null,null,null,null,null,null,null,"1. Welche Akteure sollen aktiv in den Erarbeitungsprozess einbezogen werden? ",null,null,null,null,null,null,null,"1. Welche Akteure sollen aktiv in den Erarbeitungsprozess einbezogen werden? ",null,null,null,null,null,null,null,"1. Welche Akteure sollen aktiv in den Erarbeitungsprozess einbezogen werden? ",null,null,null,null,null,null,null,"1. Welche Akteure sollen aktiv in den Erarbeitungsprozess einbezogen werden? ",null,null,null,null,null,null,null,"1. Welche Akteure sollen aktiv in den Erarbeitungsprozess einbezogen werden? ",null,null,null,null,null,null,null,"1. Welche Akteure sollen aktiv in den Erarbeitungsprozess einbezogen werden? ",null,null,null,null,null,null,null,"1. Welche Akteure sollen aktiv in den Erarbeitungsprozess einbezogen werden? ",null,null,null,null,null,null,null,"1. Welche Akteure sollen aktiv in den Erarbeitungsprozess einbezogen werden? ",null,null,null,null,null,null,null,"1. Welche Akteure sollen aktiv in den Erarbeitungsprozess einbezogen werden? ",null,null,null,null,null,null,null,"1. Welche Akteure sollen aktiv in den Erarbeitungsprozess einbezogen werden? ",null,null,null,null,null,null,null,"1. Welche Akteure sollen aktiv in den Erarbeitungsprozess einbezogen werden? ",null,null,null,null,null,null,null,"1. Welche Akteure sollen aktiv in den Erarbeitungsprozess einbezogen werden? ",null,null,null,null,null,null,null,"1. Welche Akteure sollen aktiv in den Erarbeitungsprozess einbezogen werden? ",null,null,null,null,null,null,null,"1. Welche Akteure sollen aktiv in den Erarbeitungsprozess einbezogen werden? ",null,null,null,null,null,null,null,"1. Welche Akteure sollen aktiv in den Erarbeitungsprozess einbezogen werden? ",null,null,null,null,null,null,null,"1. Welche Akteure sollen aktiv in den Erarbeitungsprozess einbezogen werden? ",null,null,null,null,null,null,null,"1. Welche Akteure sollen aktiv in den Erarbeitungsprozess einbezogen werden? ",null,null,null,null,null,null,null,"1. Welche Akteure sollen aktiv in den Erarbeitungsprozess einbezogen werden? ",null,null,null,null,null,null,null,"1. Welche Akteure sollen aktiv in den Erarbeitungsprozess einbezogen werden? ",null,null,null,null,null,null,null,"1. Welche Akteure sollen aktiv in den Erarbeitungsprozess einbezogen werden? ",null,null,null,null,null,null,null,"1. Welche Akteure sollen aktiv in den Erarbeitungsprozess einbezogen werden? ",null,null,null,null,null,null,null,"1. Welche Akteure sollen aktiv in den Erarbeitungsprozess einbezogen werden? ",null,null,null,null,null,null,null,"1. Welche Akteure sollen aktiv in den Erarbeitungsprozess einbezogen werden? ",null,null,null,null,null,null,null,"1. Welche Akteure sollen aktiv in den Erarbeitungsprozess einbezogen werden? ",null,null,null,null,null,null,null,"1. Welche Akteure sollen aktiv in den Erarbeitungsprozess einbezogen werden? ",null,null,null,null,null,null,null,"1. Welche Akteure sollen aktiv in den Erarbeitungsprozess einbezogen werden? ",null,null,null,null,null,null,null,"1. Welche Akteure sollen aktiv in den Erarbeitungsprozess einbezogen werden? ",null,null,null,null,null,null,null,"1. Welche Akteure sollen aktiv in den Erarbeitungsprozess einbezogen werden? ",null,null,null,null,null,null,null,"1. Welche Akteure sollen aktiv in den Erarbeitungsprozess einbezogen werden? ",null,null,null,null,null,null,null,"1. Welche Akteure sollen aktiv in den Erarbeitungsprozess einbezogen werden? ",null,null,null,null,null,null,null,"1. Welche Akteure sollen aktiv in den Erarbeitungsprozess einbezogen werden? ",null,null,null,null,null,null,null,"1. Welche Akteure sollen aktiv in den Erarbeitungsprozess einbezogen werden? ",null,null,null,null,null,null,null,"1. Welche Akteure sollen aktiv in den Erarbeitungsprozess einbezogen werden? ",null,null,null,null,null,null,null,"1. Welche Akteure sollen aktiv in den Erarbeitungsprozess einbezogen werden? ",null,null,null,null,null,null,null,"1. Welche Akteure sollen aktiv in den Erarbeitungsprozess einbezogen werden? ",null,null,null,null,null,null,null,"1. Welche Akteure sollen aktiv in den Erarbeitungsprozess einbezogen werden? ",null,null,null,null,null,null,null,"1. Welche Akteure sollen aktiv in den Erarbeitungsprozess einbezogen werden? ",null,null,null,null,null,null,null,"1. Welche Akteure sollen aktiv in den Erarbeitungsprozess einbezogen werden? ",null,null,null,null,null,null,null,"1. Welche Akteure sollen aktiv in den Erarbeitungsprozess einbezogen werden? ",null,null,null,null,null,null,null,"1. Welche Akteure sollen aktiv in den Erarbeitungsprozess einbezogen werden? ",null,null,null,null,null,null,null,"1. Welche Akteure sollen aktiv in den Erarbeitungsprozess einbezogen werden? ",null,null,null,null,null,null,null,"1. Welche Akteure sollen aktiv in den Erarbeitungsprozess einbezogen werden? ",null,null,null,null,null,null,null,"1. Welche Akteure sollen aktiv in den Erarbeitungsprozess einbezogen werden? ",null,null,null,null,null,null,null,"1. Welche Akteure sollen aktiv in den Erarbeitungsprozess einbezogen werden? ",null,null,null,null,null,null,null,"1. Welche Akteure sollen aktiv in den Erarbeitungsprozess einbezogen werden? ",null,null,null,null,null,null,null,"1. Welche Akteure sollen aktiv in den Erarbeitungsprozess einbezogen werden? ",null,null,null,null,null,null,null,"1. Welche Akteure sollen aktiv in den Erarbeitungsprozess einbezogen werden? ",null,null,null,null,null,null,null,"1. Welche Akteure sollen aktiv in den Erarbeitungsprozess einbezogen werden? ",null,null,null,null,null,null,null,"1. Welche Akteure sollen aktiv in den Erarbeitungsprozess einbezogen werden? ",null,null,null,null,null,null,null,"1. Welche Akteure sollen aktiv in den Erarbeitungsprozess einbezogen werden? ",null,null,null,null,null,null,null,"1. Welche Akteure sollen aktiv in den Erarbeitungsprozess einbezogen werden? ",null,null,null,null,null,null,null,"1. Welche Akteure sollen aktiv in den Erarbeitungsprozess einbezogen werden? ",null,null,null,null,null,null,null,"1. Welche Akteure sollen aktiv in den Erarbeitungsprozess einbezogen werden? ",null,null,null,null,null,null,null,"1. Welche Akteure sollen aktiv in den Erarbeitungsprozess einbezogen werden? ",null,null,null,null,null,null,null,"1. Welche Akteure sollen aktiv in den Erarbeitungsprozess einbezogen werden? ",null,null,null,null,null,null,null,"1. Welche Akteure sollen aktiv in den Erarbeitungsprozess einbezogen werden? ",null,null,null,null,null,null,null,"1. Welche Akteure sollen aktiv in den Erarbeitungsprozess einbezogen werden? ",null,null,null,null,null,null,null,"1. Welche Akteure sollen aktiv in den Erarbeitungsprozess einbezogen werden? ",null,null,null,null,null,null,null,"1. Welche Akteure sollen aktiv in den Erarbeitungsprozess einbezogen werden? ",null,null,null,null,null,null,null,"1. Welche Akteure sollen aktiv in den Erarbeitungsprozess einbezogen werden? ",null,null,null,null,null,null,null,"1. Welche Akteure sollen aktiv in den Erarbeitungsprozess einbezogen werden? ",null,null,null,null,null,null,null,"1. Welche Akteure sollen aktiv in den Erarbeitungsprozess einbezogen werden? ",null,null,null,null,null,null,null,"1. Welche Akteure sollen aktiv in den Erarbeitungsprozess einbezogen werden? ",null,null,null,null,null,null,null,"1. Welche Akteure sollen aktiv in den Erarbeitungsprozess einbezogen werden? ",null,null,null,null,null,null,null,"1. Welche Akteure sollen aktiv in den Erarbeitungsprozess einbezogen werden? ",null,null,null,null,null,null,null,"1. Welche Akteure sollen aktiv in den Erarbeitungsprozess einbezogen werden? ",null,null,null,null,null,null,null,"1. Welche Akteure sollen aktiv in den Erarbeitungsprozess einbezogen werden? ",null,null,null,null,null,null,null,"1. Welche Akteure sollen aktiv in den Erarbeitungsprozess einbezogen werden? ",null,null,null,null,null,null,null,"1. Welche Akteure sollen aktiv in den Erarbeitungsprozess einbezogen werden? ",null,null,null,null,null,null,null,"1. Welche Akteure sollen aktiv in den Erarbeitungsprozess einbezogen werden? ",null,null,null,null,null,null,null,"1. Welche Akteure sollen aktiv in den Erarbeitungsprozess einbezogen werden? ",null,null,null,null,null,null,null,"1. Welche Akteure sollen aktiv in den Erarbeitungsprozess einbezogen werden? ",null,null,null,null,null,null,null,"1. Welche Akteure sollen aktiv in den Erarbeitungsprozess einbezogen werden? ",null,null,null,null,null,null,null,"1. Welche Akteure sollen aktiv in den Erarbeitungsprozess einbezogen werden? ",null,null,null,null,null,null,null,"1. Welche Akteure sollen aktiv in den Erarbeitungsprozess einbezogen werden? ",null,null,null,null,null,null,null,"1. Welche Akteure sollen aktiv in den Erarbeitungsprozess einbezogen werden? ",null,null,null,null,null,null,null,"1. Welche Akteure sollen aktiv in den Erarbeitungsprozess einbezogen werden? ",null,null,null,null,null,null,null,"1. Welche Akteure sollen aktiv in den Erarbeitungsprozess einbezogen werden? ",null,null,null,null,null,null,null,"1. Welche Akteure sollen aktiv in den Erarbeitungsprozess einbezogen werden? ",null,null,null,null,null,null,null,"1. Welche Akteure sollen aktiv in den Erarbeitungsprozess einbezogen werden? ",null,null,null,null,null,null,null,"1. Welche Akteure sollen aktiv in den Erarbeitungsprozess einbezogen werden? ",null,null,null,null,null,null,null,"1. Welche Akteure sollen aktiv in den Erarbeitungsprozess einbezogen werden? ",null,null,null,null,null,null,null,"1. Welche Akteure sollen aktiv in den Erarbeitungsprozess einbezogen werden? ",null,null,null,null,null,null,null,"1. Welche Akteure sollen aktiv in den Erarbeitungsprozess einbezogen werden? ",null,null,null,null,null,null,null,"1. Welche Akteure sollen aktiv in den Erarbeitungsprozess einbezogen werden? ",null,null,null,null,null,null,null,"1. Welche Akteure sollen aktiv in den Erarbeitungsprozess einbezogen werden? ",null,null,null,null,null,null,null,"1. Welche Akteure sollen aktiv in den Erarbeitungsprozess einbezogen werden? ",null,null,null,null,null,null,null,"1. Welche Akteure sollen aktiv in den Erarbeitungsprozess einbezogen werden? ",null,null,null,null,null,null,null,"1. Welche Akteure sollen aktiv in den Erarbeitungsprozess einbezogen werden? ",null,null,null,null,null,null,null,"1. Welche Akteure sollen aktiv in den Erarbeitungsprozess einbezogen werden? ",null,null,null,null,null,null,null,"1. Welche Akteure sollen aktiv in den Erarbeitungsprozess einbezogen werden? ",null,null,null,null,null,null,null,"1. Welche Akteure sollen aktiv in den Erarbeitungsprozess einbezogen werden? ",null,null,null,null,null,null,null,"1. Welche Akteure sollen aktiv in den Erarbeitungsprozess einbezogen werden? ",null,null,null,null,null,null,null,"1. Welche Akteure sollen aktiv in den Erarbeitungsprozess einbezogen werden? ",null,null,null,null,null,null,null,"1. Welche Akteure sollen aktiv in den Erarbeitungsprozess einbezogen werden? ",null,null,null,null,null,null,null,"1. Welche Akteure sollen aktiv in den Erarbeitungsprozess einbezogen werden? ",null,null,null,null,null,null,null,"1. Welche Akteure sollen aktiv in den Erarbeitungsprozess einbezogen werden? ",null,null,null,null,null,null,null,"1. Welche Akteure sollen aktiv in den Erarbeitungsprozess einbezogen werden? ",null,null,null,null,null,null,null,"1. Welche Akteure sollen aktiv in den Erarbeitungsprozess einbezogen werden? ",null,null,null,null,null,null,null,"1. Welche Akteure sollen aktiv in den Erarbeitungsprozess einbezogen werden? ",null,null,null,null,null,null,null,"1. Welche Akteure sollen aktiv in den Erarbeitungsprozess einbezogen werden? ",null,null,null,null,null,null,null,"1. Welche Akteure sollen aktiv in den Erarbeitungsprozess einbezogen werden? ",null,null,null,null,null,null,null,"1. Welche Akteure sollen aktiv in den Erarbeitungsprozess einbezogen werden? ",null,null,null,null,null,null,null,"1. Welche Akteure sollen aktiv in den Erarbeitungsprozess einbezogen werden? ",null,null,null,null,null,null,null,"1. Welche Akteure sollen aktiv in den Erarbeitungsprozess einbezogen werden? ",null,null,null,null,null,null,null,"1. Welche Akteure sollen aktiv in den Erarbeitungsprozess einbezogen werden? ",null,null,null,null,null,null,null,"1. Welche Akteure sollen aktiv in den Erarbeitungsprozess einbezogen werden? ",null,null,null,null,null,null,null,"1. Welche Akteure sollen aktiv in den Erarbeitungsprozess einbezogen werden? ",null,null,null,null,null,null,null,"1. Welche Akteure sollen aktiv in den Erarbeitungsprozess einbezogen werden? ",null,null,null,null,null,null,null,"1. Welche Akteure sollen aktiv in den Erarbeitungsprozess einbezogen werden? ",null,null,null,null,null,null,null,"1. Welche Akteure sollen aktiv in den Erarbeitungsprozess einbezogen werden? ",null,null,null,null,null,null,null,"1. Welche Akteure sollen aktiv in den Erarbeitungsprozess einbezogen werden? ",null,null,null,null,null,null,null,"1. Welche Akteure sollen aktiv in den Erarbeitungsprozess einbezogen werden? ",null,null,null,null,null,null,null,"1. Welche Akteure sollen aktiv in den Erarbeitungsprozess einbezogen werden? ",null,null,null,null,null,null,null,"1. Welche Akteure sollen aktiv in den Erarbeitungsprozess einbezogen werden? ",null,null,null,null,null,null,null,"1. Welche Akteure sollen aktiv in den Erarbeitungsprozess einbezogen werden? ",null,null,null,null,null,null,null,"1. Welche Akteure sollen aktiv in den Erarbeitungsprozess einbezogen werden? ",null,null,null,null,null,null,null,"1. Welche Akteure sollen aktiv in den Erarbeitungsprozess einbezogen werden? ",null,null,null,null,null,null,null,"1. Welche Akteure sollen aktiv in den Erarbeitungsprozess einbezogen werden? ",null,null,null,null,null,null,null,"1. Welche Akteure sollen aktiv in den Erarbeitungsprozess einbezogen werden? ",null,null,null,null,null,null,null,"1. Welche Akteure sollen aktiv in den Erarbeitungsprozess einbezogen werden? ",null,null,null,null,null,null,null,"1. Welche Akteure sollen aktiv in den Erarbeitungsprozess einbezogen werden? ",null,null,null,null,null,null,null,"1. Welche Akteure sollen aktiv in den Erarbeitungsprozess einbezogen werden? ",null,null,null,null,null,null,null,"1. Welche Akteure sollen aktiv in den Erarbeitungsprozess einbezogen werden? ",null,null,null,null,null,null,null,"1. Welche Akteure sollen aktiv in den Erarbeitungsprozess einbezogen werden? ",null,null,null,null,null,null,null,"1. Welche Akteure sollen aktiv in den Erarbeitungsprozess einbezogen werden? ",null,null,null,null,null,null,null,"1. Welche Akteure sollen aktiv in den Erarbeitungsprozess einbezogen werden? ",null,null,null,null,null,null,null,"1. Welche Akteure sollen aktiv in den Erarbeitungsprozess einbezogen werden? ",null,null,null,null,null,null,null,"1. Welche Akteure sollen aktiv in den Erarbeitungsprozess einbezogen werden? ",null,null,null,null,null,null,null,"1. Welche Akteure sollen aktiv in den Erarbeitungsprozess einbezogen werden? ",null,null,null,null,null,null,null,"1. Welche Akteure sollen aktiv in den Erarbeitungsprozess einbezogen werden? ",null,null,null,null,null,null,null,"1. Welche Akteure sollen aktiv in den Erarbeitungsprozess einbezogen werden? ",null,null,null,null,null,null,null,"1. Welche Akteure sollen aktiv in den Erarbeitungsprozess einbezogen werden? ",null,null,null,null,null,null,null,"1. Welche Akteure sollen aktiv in den Erarbeitungsprozess einbezogen werden? ",null,null,null,null,null,null,null,"1. Welche Akteure sollen aktiv in den Erarbeitungsprozess einbezogen werden? ",null,null,null,null,null,null,null,"1. Welche Akteure sollen aktiv in den Erarbeitungsprozess einbezogen werden? ",null,null,null,null,null,null,null,"1. Welche Akteure sollen aktiv in den Erarbeitungsprozess einbezogen werden? ",null,null,null,null,null,null,null,"1. Welche Akteure sollen aktiv in den Erarbeitungsprozess einbezogen werden? ",null,null,null,null,null,null,null,"1. Welche Akteure sollen aktiv in den Erarbeitungsprozess einbezogen werden? ",null,null,null,null,null,null,null,"1. Welche Akteure sollen aktiv in den Erarbeitungsprozess einbezogen werden? ",null,null,null,null,null,null,null,"1. Welche Akteure sollen aktiv in den Erarbeitungsprozess einbezogen werden? ",null,null,null,null,null,null,null,"1. Welche Akteure sollen aktiv in den Erarbeitungsprozess einbezogen werden? ",null,null,null,null,null,null,null,"1. Welche Akteure sollen aktiv in den Erarbeitungsprozess einbezogen werden? ",null,null,null,null,null,null,null,"1. Welche Akteure sollen aktiv in den Erarbeitungsprozess einbezogen werden? ",null,null,null,null,null,null,null,"1. Welche Akteure sollen aktiv in den Erarbeitungsprozess einbezogen werden? ",null,null,null,null,null,null,null,"1. Welche Akteure sollen aktiv in den Erarbeitungsprozess einbezogen werden? ",null,null,null,null,null,null,null,"1. Welche Akteure sollen aktiv in den Erarbeitungsprozess einbezogen werden? ",null,null,null,null,null,null,null,"1. Welche Akteure sollen aktiv in den Erarbeitungsprozess einbezogen werden? ",null,null,null,null,null,null,null,"1. Welche Akteure sollen aktiv in den Erarbeitungsprozess einbezogen werden? ",null,null,null,null,null,null,null,"1. Welche Akteure sollen aktiv in den Erarbeitungsprozess einbezogen werden? ",null,null,null,null,null,null,null,"1. Welche Akteure sollen aktiv in den Erarbeitungsprozess einbezogen werden? ",null,null,null,null,null,null,null,"1. Welche Akteure sollen aktiv in den Erarbeitungsprozess einbezogen werden? ",null,null,null,null,null,null,null,"1. Welche Akteure sollen aktiv in den Erarbeitungsprozess einbezogen werden? ",null,null,null,null,null,null,null,"1. Welche Akteure sollen aktiv in den Erarbeitungsprozess einbezogen werden? ",null,null,null,null,null,null,null,"1. Welche Akteure sollen aktiv in den Erarbeitungsprozess einbezogen werden? ",null,null,null,null,null,null,null,"1. Welche Akteure sollen aktiv in den Erarbeitungsprozess einbezogen werden? ",null,null,null,null,null,null,null,"1. Welche Akteure sollen aktiv in den Erarbeitungsprozess einbezogen werden? ",null,null,null,null,null,null,null,"1. Welche Akteure sollen aktiv in den Erarbeitungsprozess einbezogen werden? ",null,null,null,null,null,null,null,"1. Welche Akteure sollen aktiv in den Erarbeitungsprozess einbezogen werden? ",null,null,null,null,null,null,null,"1. Welche Akteure sollen aktiv in den Erarbeitungsprozess einbezogen werden? ",null,null,null,null,null,null,null,"1. Welche Akteure sollen aktiv in den Erarbeitungsprozess einbezogen werden? ",null,null,null,null,null,null,null,"1. Welche Akteure sollen aktiv in den Erarbeitungsprozess einbezogen werden? ",null,null,null,null,null,null,null,"1. Welche Akteure sollen aktiv in den Erarbeitungsprozess einbezogen werden? ",null,null,null,null,null,null,null,"1. Welche Akteure sollen aktiv in den Erarbeitungsprozess einbezogen werden? ",null,null,null,null,null,null,null,"1. Welche Akteure sollen aktiv in den Erarbeitungsprozess einbezogen werden? ",null,null,null,null,null,null,null,"1. Welche Akteure sollen aktiv in den Erarbeitungsprozess einbezogen werden? ",null,null,null,null,null,null,null,"1. Welche Akteure sollen aktiv in den Erarbeitungsprozess einbezogen werden? ",null,null,null,null,null,null,null,"1. Welche Akteure sollen aktiv in den Erarbeitungsprozess einbezogen werden? ",null,null,null,null,null,null,null,"1. Welche Akteure sollen aktiv in den Erarbeitungsprozess einbezogen werden? ",null,null,null,null,null,null,null,"1. Welche Akteure sollen aktiv in den Erarbeitungsprozess einbezogen werden? ",null,null,null,null,null,null,null,"1. Welche Akteure sollen aktiv in den Erarbeitungsprozess einbezogen werden? ",null,null,null,null,null,null,null,"1. Welche Akteure sollen aktiv in den Erarbeitungsprozess einbezogen werden? ",null,null,null,null,null,null,null,"1. Welche Akteure sollen aktiv in den Erarbeitungsprozess einbezogen werden? ",null,null,null,null,null,null,null,"1. Welche Akteure sollen aktiv in den Erarbeitungsprozess einbezogen werden? ",null,null,null,null,null,null,null,"1. Welche Akteure sollen aktiv in den Erarbeitungsprozess einbezogen werden? ",null,null,null,null,null,null,null,"1. Welche Akteure sollen aktiv in den Erarbeitungsprozess einbezogen werden? ",null,null,null,null,null,null,null,"1. Welche Akteure sollen aktiv in den Erarbeitungsprozess einbezogen werden? ",null,null,null,null,null,null,null,"1. Welche Akteure sollen aktiv in den Erarbeitungsprozess einbezogen werden? ",null,null,null,null,null,null,null,"1. Welche Akteure sollen aktiv in den Erarbeitungsprozess einbezogen werden? ",null,null,null,null,null,null,null,"1. Welche Akteure sollen aktiv in den Erarbeitungsprozess einbezogen werden? ",null,null,null,null,null,null,null,"1. Welche Akteure sollen aktiv in den Erarbeitungsprozess einbezogen werden? ",null,null,null,null,null,null,null,"1. Welche Akteure sollen aktiv in den Erarbeitungsprozess einbezogen werden? ",null,null,null,null,null,null,null,"1. Welche Akteure sollen aktiv in den Erarbeitungsprozess einbezogen werden? ",null,null,null,null,null,null,null,"1. Welche Akteure sollen aktiv in den Erarbeitungsprozess einbezogen werden? ",null,null,null,null,null,null,null,"1. Welche Akteure sollen aktiv in den Erarbeitungsprozess einbezogen werden? ",null,null,null,null,null,null,null,"1. Welche Akteure sollen aktiv in den Erarbeitungsprozess einbezogen werden? ",null,null,null,null,null,null,null,"1. Welche Akteure sollen aktiv in den Erarbeitungsprozess einbezogen werden? ",null,null,null,null,null,null,null,"1. Welche Akteure sollen aktiv in den Erarbeitungsprozess einbezogen werden? ",null,null,null,null,null,null,null,"1. Welche Akteure sollen aktiv in den Erarbeitungsprozess einbezogen werden? ",null,null,null,null,null,null,null,"1. Welche Akteure sollen aktiv in den Erarbeitungsprozess einbezogen werden? ",null,null,null,null,null,null,null,"1. Welche Akteure sollen aktiv in den Erarbeitungsprozess einbezogen werden? ",null,null,null,null,null,null,null,"1. Welche Akteure sollen aktiv in den Erarbeitungsprozess einbezogen werden? ",null,null,null,null,null,null,null,"1. Welche Akteure sollen aktiv in den Erarbeitungsprozess einbezogen werden? ",null,null,null,null,null,null,null,"1. Welche Akteure sollen aktiv in den Erarbeitungsprozess einbezogen werden? ",null,null,null,null,null,null,null,"1. Welche Akteure sollen aktiv in den Erarbeitungsprozess einbezogen werden? ",null,null,null,null,null,null,null,"1. Welche Akteure sollen aktiv in den Erarbeitungsprozess einbezogen werden? ",null,null,null,null,null,null,null,"1. Welche Akteure sollen aktiv in den Erarbeitungsprozess einbezogen werden? ",null,null,null,null,null,null,null,"1. Welche Akteure sollen aktiv in den Erarbeitungsprozess einbezogen werden? ",null,null,null,null,null,null,null,"1. Welche Akteure sollen aktiv in den Erarbeitungsprozess einbezogen werden? ",null,null,null,null,null,null,null,"1. Welche Akteure sollen aktiv in den Erarbeitungsprozess einbezogen werden? ",null,null,null,null,null,null,null,"1. Welche Akteure sollen aktiv in den Erarbeitungsprozess einbezogen werden? ",null,null,null,null,null,null,null,"1. Welche Akteure sollen aktiv in den Erarbeitungsprozess einbezogen werden? ",null,null,null,null,null,null,null,"1. Welche Akteure sollen aktiv in den Erarbeitungsprozess einbezogen werden? ",null,null,null,null,null,null,null,"1. Welche Akteure sollen aktiv in den Erarbeitungsprozess einbezogen werden? ",null,null,null,null,null,null,null,"1. Welche Akteure sollen aktiv in den Erarbeitungsprozess einbezogen werden? ",null,null,null,null,null,null,null,"1. Welche Akteure sollen aktiv in den Erarbeitungsprozess einbezogen werden? ",null,null,null,null,null,null,null,"1. Welche Akteure sollen aktiv in den Erarbeitungsprozess einbezogen werden? ",null,null,null,null,null,null,null,"1. Welche Akteure sollen aktiv in den Erarbeitungsprozess einbezogen werden? ",null,null,null,null,null,null,null,"1. Welche Akteure sollen aktiv in den Erarbeitungsprozess einbezogen werden? ",null,null,null,null,null,null,null,"1. Welche Akteure sollen aktiv in den Erarbeitungsprozess einbezogen werden? ",null,null,null,null,null,null,null,"1. Welche Akteure sollen aktiv in den Erarbeitungsprozess einbezogen werden? ",null,null,null,null,null,null,null,"1. Welche Akteure sollen aktiv in den Erarbeitungsprozess einbezogen werden? ",null,null,null,null,null,null,null,"1. Welche Akteure sollen aktiv in den Erarbeitungsprozess einbezogen werden? ",null,null,null,null,null,null,null,"1. Welche Akteure sollen aktiv in den Erarbeitungsprozess einbezogen werden? ",null,null,null,null,null,null,null,"1. Welche Akteure sollen aktiv in den Erarbeitungsprozess einbezogen werden? ",null,null,null,null,null,null,null,"1. Welche Akteure sollen aktiv in den Erarbeitungsprozess einbezogen werden? ",null,null,null,null,null,null,null,"1. Welche Akteure sollen aktiv in den Erarbeitungsprozess einbezogen werden? ",null,null,null,null,null,null,null,"1. Welche Akteure sollen aktiv in den Erarbeitungsprozess einbezogen werden? ",null,null,null,null,null,null,null,"1. Welche Akteure sollen aktiv in den Erarbeitungsprozess einbezogen werden? ",null,null,null,null,null,null,null,"1. Welche Akteure sollen aktiv in den Erarbeitungsprozess einbezogen werden? ",null,null,null,null,null,null,null,"1. Welche Akteure sollen aktiv in den Erarbeitungsprozess einbezogen werden? ",null,null,null,null,null,null,null,"1. Welche Akteure sollen aktiv in den Erarbeitungsprozess einbezogen werden? ",null,null,null,null,null,null,null,"1. Welche Akteure sollen aktiv in den Erarbeitungsprozess einbezogen werden? ",null,null,null,null,null,null,null,"1. Welche Akteure sollen aktiv in den Erarbeitungsprozess einbezogen werden? ",null,null,null,null,null,null,null,"1. Welche Akteure sollen aktiv in den Erarbeitungsprozess einbezogen werden? ",null,null,null,null,null,null,null,"1. Welche Akteure sollen aktiv in den Erarbeitungsprozess einbezogen werden? ",null,null,null,null,null,null,null,"1. Welche Akteure sollen aktiv in den Erarbeitungsprozess einbezogen werden? ",null,null,null,null,null,null,null,"1. Welche Akteure sollen aktiv in den Erarbeitungsprozess einbezogen werden? ",null,null,null,null,null,null,null,"1. Welche Akteure sollen aktiv in den Erarbeitungsprozess einbezogen werden? ",null,null,null,null,null,null,null,"1. Welche Akteure sollen aktiv in den Erarbeitungsprozess einbezogen werden? ",null,null,null,null,null,null,null,"1. Welche Akteure sollen aktiv in den Erarbeitungsprozess einbezogen werden? ",null,null,null,null,null,null,null,"1. Welche Akteure sollen aktiv in den Erarbeitungsprozess einbezogen werden? ",null,null,null,null,null,null,null,"1. Welche Akteure sollen aktiv in den Erarbeitungsprozess einbezogen werden? ",null,null,null,null,null,null,null,"1. Welche Akteure sollen aktiv in den Erarbeitungsprozess einbezogen werden? ",null,null,null,null,null,null,null,"1. Welche Akteure sollen aktiv in den Erarbeitungsprozess einbezogen werden? ",null,null,null,null,null,null,null,"1. Welche Akteure sollen aktiv in den Erarbeitungsprozess einbezogen werden? ",null,null,null,null,null,null,null,"1. Welche Akteure sollen aktiv in den Erarbeitungsprozess einbezogen werden? ",null,null,null,null,null,null,null,"1. Welche Akteure sollen aktiv in den Erarbeitungsprozess einbezogen werden? ",null,null,null,null,null,null,null,"1. Welche Akteure sollen aktiv in den Erarbeitungsprozess einbezogen werden? ",null,null,null,null,null,null,null,"1. Welche Akteure sollen aktiv in den Erarbeitungsprozess einbezogen werden? ",null,null,null,null,null,null,null,"1. Welche Akteure sollen aktiv in den Erarbeitungsprozess einbezogen werden? ",null,null,null,null,null,null,null,"1. Welche Akteure sollen aktiv in den Erarbeitungsprozess einbezogen werden? ",null,null,null,null,null,null,null,"1. Welche Akteure sollen aktiv in den Erarbeitungsprozess einbezogen werden? ",null,null,null,null,null,null,null,"1. Welche Akteure sollen aktiv in den Erarbeitungsprozess einbezogen werden? ",null,null,null,null,null,null,null,"1. Welche Akteure sollen aktiv in den Erarbeitungsprozess einbezogen werden? ",null,null,null,null,null,null,null,"1. Welche Akteure sollen aktiv in den Erarbeitungsprozess einbezogen werden? ",null,null,null,null,null,null,null,"1. Welche Akteure sollen aktiv in den Erarbeitungsprozess einbezogen werden? ",null,null,null,null,null,null,null,"1. Welche Akteure sollen aktiv in den Erarbeitungsprozess einbezogen werden? ",null,null,null,null,null,null,null,"1. Welche Akteure sollen aktiv in den Erarbeitungsprozess einbezogen werden? ",null,null,null,null,null,null,null,"1. Welche Akteure sollen aktiv in den Erarbeitungsprozess einbezogen werden? ",null,null,null,null,null,null,null,"1. Welche Akteure sollen aktiv in den Erarbeitungsprozess einbezogen werden? ",null,null,null,null,null,null,null,"1. Welche Akteure sollen aktiv in den Erarbeitungsprozess einbezogen werden? ",null,null,null,null,null,null,null,"1. Welche Akteure sollen aktiv in den Erarbeitungsprozess einbezogen werden? ",null,null,null,null,null,null,null,"1. Welche Akteure sollen aktiv in den Erarbeitungsprozess einbezogen werden? ",null,null,null,null,null,null,null,"1. Welche Akteure sollen aktiv in den Erarbeitungsprozess einbezogen werden? ",null,null,null,null,null,null,null,"1. Welche Akteure sollen aktiv in den Erarbeitungsprozess einbezogen werden? ",null,null,null,null,null,null,null,"1. Welche Akteure sollen aktiv in den Erarbeitungsprozess einbezogen werden? ",null,null,null,null,null,null,null,"1. Welche Akteure sollen aktiv in den Erarbeitungsprozess einbezogen werden? ",null,null,null,null,null,null,null,"1. Welche Akteure sollen aktiv in den Erarbeitungsprozess einbezogen werden? ",null,null,null,null,null,null,null,"1. Welche Akteure sollen aktiv in den Erarbeitungsprozess einbezogen werden? ",null,null,null,null,null,null,null,"1. Welche Akteure sollen aktiv in den Erarbeitungsprozess einbezogen werden? ",null,null,null,null,null,null,null,"1. Welche Akteure sollen aktiv in den Erarbeitungsprozess einbezogen werden? ",null,null,null,null,null,null,null,"1. Welche Akteure sollen aktiv in den Erarbeitungsprozess einbezogen werden? ",null,null,null,null,null,null,null,"1. Welche Akteure sollen aktiv in den Erarbeitungsprozess einbezogen werden? ",null,null,null,null,null,null,null,"1. Welche Akteure sollen aktiv in den Erarbeitungsprozess einbezogen werden? ",null,null,null,null,null,null,null,"1. Welche Akteure sollen aktiv in den Erarbeitungsprozess einbezogen werden? ",null,null,null,null,null,null,null,"1. Welche Akteure sollen aktiv in den Erarbeitungsprozess einbezogen werden? ",null,null,null,null,null,null,null,"1. Welche Akteure sollen aktiv in den Erarbeitungsprozess einbezogen werden? ",null,null,null,null,null,null,null,"1. Welche Akteure sollen aktiv in den Erarbeitungsprozess einbezogen werden? ",null,null,null,null,null,null,null,"1. Welche Akteure sollen aktiv in den Erarbeitungsprozess einbezogen werden? ",null,null,null,null,null,null,null,"1. Welche Akteure sollen aktiv in den Erarbeitungsprozess einbezogen werden? ",null,null,null,null,null,null,null,"1. Welche Akteure sollen aktiv in den Erarbeitungsprozess einbezogen werden? ",null,null,null,null,null,null,null,"1. Welche Akteure sollen aktiv in den Erarbeitungsprozess einbezogen werden? ",null,null,null,null,null,null,null,"1. Welche Akteure sollen aktiv in den Erarbeitungsprozess einbezogen werden? ",null,null,null,null,null,null,null,"1. Welche Akteure sollen aktiv in den Erarbeitungsprozess einbezogen werden? ",null,null,null,null,null,null,null,"1. Welche Akteure sollen aktiv in den Erarbeitungsprozess einbezogen werden? ",null,null,null,null,null,null,null,"1. Welche Akteure sollen aktiv in den Erarbeitungsprozess einbezogen werden? ",null,null,null,null,null,null,null,"1. Welche Akteure sollen aktiv in den Erarbeitungsprozess einbezogen werden? ",null,null,null,null,null,null,null,"1. Welche Akteure sollen aktiv in den Erarbeitungsprozess einbezogen werden? ",null,null,null,null,null,null,null,"1. Welche Akteure sollen aktiv in den Erarbeitungsprozess einbezogen werden? ",null,null,null,null,null,null,null,"1. Welche Akteure sollen aktiv in den Erarbeitungsprozess einbezogen werden? ",null,null,null,null,null,null,null,"1. Welche Akteure sollen aktiv in den Erarbeitungsprozess einbezogen werden? ",null,null,null,null,null,null,null,"1. Welche Akteure sollen aktiv in den Erarbeitungsprozess einbezogen werden? ",null,null,null,null,null,null,null,"1. Welche Akteure sollen aktiv in den Erarbeitungsprozess einbezogen werden? ",null,null,null,null,null,null,null,"1. Welche Akteure sollen aktiv in den Erarbeitungsprozess einbezogen werden? ",null,null,null,null,null,null,null,"1. Welche Akteure sollen aktiv in den Erarbeitungsprozess einbezogen werden? ",null,null,null,null,null,null,null,"1. Welche Akteure sollen aktiv in den Erarbeitungsprozess einbezogen werden? ",null,null,null,null,null,null,null,"1. Welche Akteure sollen aktiv in den Erarbeitungsprozess einbezogen werden? ",null,null,null,null,null,null,null,"1. Welche Akteure sollen aktiv in den Erarbeitungsprozess einbezogen werden? ",null,null,null,null,null,null,null,"1. Welche Akteure sollen aktiv in den Erarbeitungsprozess einbezogen werden? ",null,null,null,null,null,null,null,"1. Welche Akteure sollen aktiv in den Erarbeitungsprozess einbezogen werden? ",null,null,null,null,null,null,null,"1. Welche Akteure sollen aktiv in den Erarbeitungsprozess einbezogen werden? ",null,null,null,null,null,null,null,"1. Welche Akteure sollen aktiv in den Erarbeitungsprozess einbezogen werden? ",null,null,null,null,null,null,null,"1. Welche Akteure sollen aktiv in den Erarbeitungsprozess einbezogen werden? ",null,null,null,null,null,null,null,"1. Welche Akteure sollen aktiv in den Erarbeitungsprozess einbezogen werden? ",null,null,null,null,null,null,null,"1. Welche Akteure sollen aktiv in den Erarbeitungsprozess einbezogen werden? ",null,null,null,null,null,null,null,"1. Welche Akteure sollen aktiv in den Erarbeitungsprozess einbezogen werden? ",null,null,null,null,null,null,null,"1. Welche Akteure sollen aktiv in den Erarbeitungsprozess einbezogen werden? ",null,null,null,null,null,null,null,"1. Welche Akteure sollen aktiv in den Erarbeitungsprozess einbezogen werden? ",null,null,null,null,null,null,null,"1. Welche Akteure sollen aktiv in den Erarbeitungsprozess einbezogen werden? ",null,null,null,null,null,null,null,"1. Welche Akteure sollen aktiv in den Erarbeitungsprozess einbezogen werden? ",null,null,null,null,null,null,null,"1. Welche Akteure sollen aktiv in den Erarbeitungsprozess einbezogen werden? ",null,null,null,null,null,null,null,"1. Welche Akteure sollen aktiv in den Erarbeitungsprozess einbezogen werden? ",null,null,null,null,null,null,null,"1. Welche Akteure sollen aktiv in den Erarbeitungsprozess einbezogen werden? ",null,null,null,null,null,null,null,"1. Welche Akteure sollen aktiv in den Erarbeitungsprozess einbezogen werden? ",null,null,null,null,null,null,null,"1. Welche Akteure sollen aktiv in den Erarbeitungsprozess einbezogen werden? ",null,null,null,null,null,null,null,"1. Welche Akteure sollen aktiv in den Erarbeitungsprozess einbezogen werden? ",null,null,null,null,null,null,null,"1. Welche Akteure sollen aktiv in den Erarbeitungsprozess einbezogen werden? ",null,null,null,null,null,null,null,"1. Welche Akteure sollen aktiv in den Erarbeitungsprozess einbezogen werden? ",null,null,null,null,null,null,null,"1. Welche Akteure sollen aktiv in den Erarbeitungsprozess einbezogen werden? ",null,null,null,null,null,null,null,"1. Welche Akteure sollen aktiv in den Erarbeitungsprozess einbezogen werden? ",null,null,null,null,null,null,null,"1. Welche Akteure sollen aktiv in den Erarbeitungsprozess einbezogen werden? ",null,null,null,null,null,null,null,"1. Welche Akteure sollen aktiv in den Erarbeitungsprozess einbezogen werden? ",null,null,null,null,null,null,null,"1. Welche Akteure sollen aktiv in den Erarbeitungsprozess einbezogen werden? ",null,null,null,null,null,null,null,"1. Welche Akteure sollen aktiv in den Erarbeitungsprozess einbezogen werden? ",null,null,null,null,null,null,null,"1. Welche Akteure sollen aktiv in den Erarbeitungsprozess einbezogen werden? ",null,null,null,null,null,null,null,"1. Welche Akteure sollen aktiv in den Erarbeitungsprozess einbezogen werden? ",null,null,null,null,null,null,null,"1. Welche Akteure sollen aktiv in den Erarbeitungsprozess einbezogen werden? ",null,null,null,null,null,null,null,"1. Welche Akteure sollen aktiv in den Erarbeitungsprozess einbezogen werden? ",null,null,null,null,null,null,null,"1. Welche Akteure sollen aktiv in den Erarbeitungsprozess einbezogen werden? ",null,null,null,null,null,null,null,"1. Welche Akteure sollen aktiv in den Erarbeitungsprozess einbezogen werden? ",null,null,null,null,null,null,null,"1. Welche Akteure sollen aktiv in den Erarbeitungsprozess einbezogen werden? ",null,null,null,null,null,null,null,"1. Welche Akteure sollen aktiv in den Erarbeitungsprozess einbezogen werden? ",null,null,null,null,null,null,null,"1. Welche Akteure sollen aktiv in den Erarbeitungsprozess einbezogen werden? ",null,null,null,null,null,null,null,"1. Welche Akteure sollen aktiv in den Erarbeitungsprozess einbezogen werden? ",null,null,null,null,null,null,null,"1. Welche Akteure sollen aktiv in den Erarbeitungsprozess einbezogen werden? ",null,null,null,null,null,null,null,"1. Welche Akteure sollen aktiv in den Erarbeitungsprozess einbezogen werden? ",null,null,null,null,null,null,null,"1. Welche Akteure sollen aktiv in den Erarbeitungsprozess einbezogen werden? ",null,null,null,null,null,null,null,"1. Welche Akteure sollen aktiv in den Erarbeitungsprozess einbezogen werden? ",null,null,null,null,null,null,null,"1. Welche Akteure sollen aktiv in den Erarbeitungsprozess einbezogen werden? ",null,null,null,null,null,null,null,"1. Welche Akteure sollen aktiv in den Erarbeitungsprozess einbezogen werden? ",null,null,null,null,null,null,null,"1. Welche Akteure sollen aktiv in den Erarbeitungsprozess einbezogen werden? ",null,null,null,null,null,null,null,"1. Welche Akteure sollen aktiv in den Erarbeitungsprozess einbezogen werden? ",null,null,null,null,null,null,null,"1. Welche Akteure sollen aktiv in den Erarbeitungsprozess einbezogen werden? ",null,null,null,null,null,null,null,"1. Welche Akteure sollen aktiv in den Erarbeitungsprozess einbezogen werden? ",null,null,null,null,null,null,null,"1. Welche Akteure sollen aktiv in den Erarbeitungsprozess einbezogen werden? ",null,null,null,null,null,null,null,"1. Welche Akteure sollen aktiv in den Erarbeitungsprozess einbezogen werden? ",null,null,null,null,null,null,null,"1. Welche Akteure sollen aktiv in den Erarbeitungsprozess einbezogen werden? ",null,null,null,null,null,null,null,"1. Welche Akteure sollen aktiv in den Erarbeitungsprozess einbezogen werden? ",null,null,null,null,null,null,null,"1. Welche Akteure sollen aktiv in den Erarbeitungsprozess einbezogen werden? ",null,null,null,null,null,null,null,"1. Welche Akteure sollen aktiv in den Erarbeitungsprozess einbezogen werden? ",null,null,null,null,null,null,null,"1. Welche Akteure sollen aktiv in den Erarbeitungsprozess einbezogen werden? ",null,null,null,null,null,null,null,"1. Welche Akteure sollen aktiv in den Erarbeitungsprozess einbezogen werden? ",null,null,null,null,null,null,null,"1. Welche Akteure sollen aktiv in den Erarbeitungsprozess einbezogen werden? ",null,null,null,null,null,null,null,"1. Welche Akteure sollen aktiv in den Erarbeitungsprozess einbezogen werden? ",null,null,null,null,null,null,null,"1. Welche Akteure sollen aktiv in den Erarbeitungsprozess einbezogen werden? ",null,null,null,null,null,null,null,"1. Welche Akteure sollen aktiv in den Erarbeitungsprozess einbezogen werden? ",null,null,null,null,null,null,null,"1. Welche Akteure sollen aktiv in den Erarbeitungsprozess einbezogen werden? ",null,null,null,null,null,null,null,"1. Welche Akteure sollen aktiv in den Erarbeitungsprozess einbezogen werden? ",null,null,null,null,null,null,null,"1. Welche Akteure sollen aktiv in den Erarbeitungsprozess einbezogen werden? ",null,null,null,null,null,null,null,"1. Welche Akteure sollen aktiv in den Erarbeitungsprozess einbezogen werden? ",null,null,null,null,null,null,null,"1. Welche Akteure sollen aktiv in den Erarbeitungsprozess einbezogen werden? ",null,null,null,null,null,null,null,"1. Welche Akteure sollen aktiv in den Erarbeitungsprozess einbezogen werden? ",null,null,null,null,null,null,null,"1. Welche Akteure sollen aktiv in den Erarbeitungsprozess einbezogen werden? ",null,null,null,null,null,null,null,"1. Welche Akteure sollen aktiv in den Erarbeitungsprozess einbezogen werden? ",null,null,null,null,null,null,null,"1. Welche Akteure sollen aktiv in den Erarbeitungsprozess einbezogen werden? ",null,null,null,null,null,null,null,"1. Welche Akteure sollen aktiv in den Erarbeitungsprozess einbezogen werden? ",null,null,null,null,null,null,null,"1. Welche Akteure sollen aktiv in den Erarbeitungsprozess einbezogen werden? ",null,null,null,null,null,null,null,"1. Welche Akteure sollen aktiv in den Erarbeitungsprozess einbezogen werden? ",null,null,null,null,null,null,null,"1. Welche Akteure sollen aktiv in den Erarbeitungsprozess einbezogen werden? ",null,null,null,null,null,null,null,"1. Welche Akteure sollen aktiv in den Erarbeitungsprozess einbezogen werden? ",null,null,null,null,null,null,null,"1. Welche Akteure sollen aktiv in den Erarbeitungsprozess einbezogen werden? ",null,null,null,null,null,null,null,"1. Welche Akteure sollen aktiv in den Erarbeitungsprozess einbezogen werden? ",null,null,null,null,null,null,null,"1. Welche Akteure sollen aktiv in den Erarbeitungsprozess einbezogen werden? ",null,null,null,null,null,null,null,"1. Welche Akteure sollen aktiv in den Erarbeitungsprozess einbezogen werden? ",null,null,null,null,null,null,null,"1. Welche Akteure sollen aktiv in den Erarbeitungsprozess einbezogen werden? ",null,null,null,null,null,null,null,"1. Welche Akteure sollen aktiv in den Erarbeitungsprozess einbezogen werden? ",null,null,null,null,null,null,null,"1. Welche Akteure sollen aktiv in den Erarbeitungsprozess einbezogen werden? ",null,null,null,null,null,null,null,"1. Welche Akteure sollen aktiv in den Erarbeitungsprozess einbezogen werden? ",null,null,null,null,null,null,null,"1. Welche Akteure sollen aktiv in den Erarbeitungsprozess einbezogen werden? ",null,null,null,null,null,null,null,"1. Welche Akteure sollen aktiv in den Erarbeitungsprozess einbezogen werden? ",null,null,null,null,null,null,null,"1. Welche Akteure sollen aktiv in den Erarbeitungsprozess einbezogen werden? ",null,null,null,null,null,null,null,"1. Welche Akteure sollen aktiv in den Erarbeitungsprozess einbezogen werden? ",null,null,null,null,null,null,null,"1. Welche Akteure sollen aktiv in den Erarbeitungsprozess einbezogen werden? ",null,null,null,null,null,null,null,"1. Welche Akteure sollen aktiv in den Erarbeitungsprozess einbezogen werden? ",null,null,null,null,null,null,null,"1. Welche Akteure sollen aktiv in den Erarbeitungsprozess einbezogen werden? ",null,null,null,null,null,null,null,"1. Welche Akteure sollen aktiv in den Erarbeitungsprozess einbezogen werden? ",null,null,null,null,null,null,null,"1. Welche Akteure sollen aktiv in den Erarbeitungsprozess einbezogen werden? ",null,null,null,null,null,null,null,"1. Welche Akteure sollen aktiv in den Erarbeitungsprozess einbezogen werden? ",null,null,null,null,null,null,null,"1. Welche Akteure sollen aktiv in den Erarbeitungsprozess einbezogen werden? ",null,null,null,null,null,null,null,"1. Welche Akteure sollen aktiv in den Erarbeitungsprozess einbezogen werden? ",null,null,null,null,null,null,null,"1. Welche Akteure sollen aktiv in den Erarbeitungsprozess einbezogen werden? ",null,null,null,null,null,null,null,"1. Welche Akteure sollen aktiv in den Erarbeitungsprozess einbezogen werden? ",null,null,null,null,null,null,null,"1. Welche Akteure sollen aktiv in den Erarbeitungsprozess einbezogen werden? ",null,null,null,null,null,null,null,"1. Welche Akteure sollen aktiv in den Erarbeitungsprozess einbezogen werden? ",null,null,null,null,null,null,null,"1. Welche Akteure sollen aktiv in den Erarbeitungsprozess einbezogen werden? ",null,null,null,null,null,null,null,"1. Welche Akteure sollen aktiv in den Erarbeitungsprozess einbezogen werden? ",null,null,null,null,null,null,null,"1. Welche Akteure sollen aktiv in den Erarbeitungsprozess einbezogen werden? ",null,null,null,null,null,null,null,"1. Welche Akteure sollen aktiv in den Erarbeitungsprozess einbezogen werden? ",null,null,null,null,null,null,null,"1. Welche Akteure sollen aktiv in den Erarbeitungsprozess einbezogen werden? ",null,null,null,null,null,null,null,"1. Welche Akteure sollen aktiv in den Erarbeitungsprozess einbezogen werden? ",null,null,null,null,null,null,null,"1. Welche Akteure sollen aktiv in den Erarbeitungsprozess einbezogen werden? ",null,null,null,null,null,null,null,"1. Welche Akteure sollen aktiv in den Erarbeitungsprozess einbezogen werden? ",null,null,null,null,null,null,null,"1. Welche Akteure sollen aktiv in den Erarbeitungsprozess einbezogen werden? ",null,null,null,null,null,null,null,"1. Welche Akteure sollen aktiv in den Erarbeitungsprozess einbezogen werden? ",null,null,null,null,null,null,null,"1. Welche Akteure sollen aktiv in den Erarbeitungsprozess einbezogen werden? ",null,null,null,null,null,null,null,"1. Welche Akteure sollen aktiv in den Erarbeitungsprozess einbezogen werden? ",null,null,null,null,null,null,null,"1. Welche Akteure sollen aktiv in den Erarbeitungsprozess einbezogen werden? ",null,null,null,null,null,null,null,"1. Welche Akteure sollen aktiv in den Erarbeitungsprozess einbezogen werden? ",null,null,null,null,null,null,null,"1. Welche Akteure sollen aktiv in den Erarbeitungsprozess einbezogen werden? ",null,null,null,null,null,null,null,"1. Welche Akteure sollen aktiv in den Erarbeitungsprozess einbezogen werden? ",null,null,null,null,null,null,null,"1. Welche Akteure sollen aktiv in den Erarbeitungsprozess einbezogen werden? ",null,null,null,null,null,null,null,"1. Welche Akteure sollen aktiv in den Erarbeitungsprozess einbezogen werden? ",null,null,null,null,null,null,null,"1. Welche Akteure sollen aktiv in den Erarbeitungsprozess einbezogen werden? ",null,null,null,null,null,null,null,"1. Welche Akteure sollen aktiv in den Erarbeitungsprozess einbezogen werden? ",null,null,null,null,null,null,null,"1. Welche Akteure sollen aktiv in den Erarbeitungsprozess einbezogen werden? ",null,null,null,null,null,null,null,"1. Welche Akteure sollen aktiv in den Erarbeitungsprozess einbezogen werden? ",null,null,null,null,null,null,null,"1. Welche Akteure sollen aktiv in den Erarbeitungsprozess einbezogen werden? ",null,null,null,null,null,null,null,"1. Welche Akteure sollen aktiv in den Erarbeitungsprozess einbezogen werden? ",null,null,null,null,null,null,null,"1. Welche Akteure sollen aktiv in den Erarbeitungsprozess einbezogen werden? ",null,null,null,null,null,null,null,"1. Welche Akteure sollen aktiv in den Erarbeitungsprozess einbezogen werden? ",null,null,null,null,null,null,null,"1. Welche Akteure sollen aktiv in den Erarbeitungsprozess einbezogen werden? ",null,null,null,null,null,null,null,"1. Welche Akteure sollen aktiv in den Erarbeitungsprozess einbezogen werden? ",null,null,null,null,null,null,null,"1. Welche Akteure sollen aktiv in den Erarbeitungsprozess einbezogen werden? ",null,null,null,null,null,null,null,"1. Welche Akteure sollen aktiv in den Erarbeitungsprozess einbezogen werden? ",null,null,null,null,null,null,null,"1. Welche Akteure sollen aktiv in den Erarbeitungsprozess einbezogen werden? ",null,null,null,null,null,null,null,"1. Welche Akteure sollen aktiv in den Erarbeitungsprozess einbezogen werden? ",null,null,null,null,null,null,null,"1. Welche Akteure sollen aktiv in den Erarbeitungsprozess einbezogen werden? ",null,null,null,null,null,null,null,"1. Welche Akteure sollen aktiv in den Erarbeitungsprozess einbezogen werden? ",null,null,null,null,null,null,null,"1. Welche Akteure sollen aktiv in den Erarbeitungsprozess einbezogen werden? ",null,null,null,null,null,null,null,"1. Welche Akteure sollen aktiv in den Erarbeitungsprozess einbezogen werden? ",null,null,null,null,null,null,null,"1. Welche Akteure sollen aktiv in den Erarbeitungsprozess einbezogen werden? ",null,null,null,null,null,null,null,"1. Welche Akteure sollen aktiv in den Erarbeitungsprozess einbezogen werden? ",null,null,null,null,null,null,null,"1. Welche Akteure sollen aktiv in den Erarbeitungsprozess einbezogen werden? ",null,null,null,null,null,null,null,"1. Welche Akteure sollen aktiv in den Erarbeitungsprozess einbezogen werden? ",null,null,null,null,null,null,null,"1. Welche Akteure sollen aktiv in den Erarbeitungsprozess einbezogen werden? ",null,null,null,null,null,null,null,"1. Welche Akteure sollen aktiv in den Erarbeitungsprozess einbezogen werden? ",null,null,null,null,null,null,null,"1. Welche Akteure sollen aktiv in den Erarbeitungsprozess einbezogen werden? ",null,null,null,null,null,null,null,"1. Welche Akteure sollen aktiv in den Erarbeitungsprozess einbezogen werden? ",null,null,null,null,null,null,null,"1. Welche Akteure sollen aktiv in den Erarbeitungsprozess einbezogen werden? ",null,null,null,null,null,null,null,"1. Welche Akteure sollen aktiv in den Erarbeitungsprozess einbezogen werden? ",null,null,null,null,null,null,null,"1. Welche Akteure sollen aktiv in den Erarbeitungsprozess einbezogen werden? ",null,null,null,null,null,null,null,"1. Welche Akteure sollen aktiv in den Erarbeitungsprozess einbezogen werden? ",null,null,null,null,null,null,null,"1. Welche Akteure sollen aktiv in den Erarbeitungsprozess einbezogen werden? ",null,null,null,null,null,null,null,"1. Welche Akteure sollen aktiv in den Erarbeitungsprozess einbezogen werden? ",null,null,null,null,null,null,null,"1. Welche Akteure sollen aktiv in den Erarbeitungsprozess einbezogen werden? ",null,null,null,null,null,null,null,"1. Welche Akteure sollen aktiv in den Erarbeitungsprozess einbezogen werden? ",null,null,null,null,null,null,null,"1. Welche Akteure sollen aktiv in den Erarbeitungsprozess einbezogen werden? ",null,null,null,null,null,null,null,"1. Welche Akteure sollen aktiv in den Erarbeitungsprozess einbezogen werden? ",null,null,null,null,null,null,null,"1. Welche Akteure sollen aktiv in den Erarbeitungsprozess einbezogen werden? ",null,null,null,null,null,null,null,"1. Welche Akteure sollen aktiv in den Erarbeitungsprozess einbezogen werden? ",null,null,null,null,null,null,null,"1. Welche Akteure sollen aktiv in den Erarbeitungsprozess einbezogen werden? ",null,null,null,null,null,null,null,"1. Welche Akteure sollen aktiv in den Erarbeitungsprozess einbezogen werden? ",null,null,null,null,null,null,null,"1. Welche Akteure sollen aktiv in den Erarbeitungsprozess einbezogen werden? ",null,null,null,null,null,null,null,"1. Welche Akteure sollen aktiv in den Erarbeitungsprozess einbezogen werden? ",null,null,null,null,null,null,null,"1. Welche Akteure sollen aktiv in den Erarbeitungsprozess einbezogen werden? ",null,null,null,null,null,null,null,"1. Welche Akteure sollen aktiv in den Erarbeitungsprozess einbezogen werden? ",null,null,null,null,null,null,null,"1. Welche Akteure sollen aktiv in den Erarbeitungsprozess einbezogen werden? ",null,null,null,null,null,null,null,"1. Welche Akteure sollen aktiv in den Erarbeitungsprozess einbezogen werden? ",null,null,null,null,null,null,null,"1. Welche Akteure sollen aktiv in den Erarbeitungsprozess einbezogen werden? ",null,null,null,null,null,null,null,"1. Welche Akteure sollen aktiv in den Erarbeitungsprozess einbezogen werden? ",null,null,null,null,null,null,null,"1. Welche Akteure sollen aktiv in den Erarbeitungsprozess einbezogen werden? ",null,null,null,null,null,null,null,"1. Welche Akteure sollen aktiv in den Erarbeitungsprozess einbezogen werden? ",null,null,null,null,null,null,null,"1. Welche Akteure sollen aktiv in den Erarbeitungsprozess einbezogen werden? ",null,null,null,null,null,null,null,"1. Welche Akteure sollen aktiv in den Erarbeitungsprozess einbezogen werden? ",null,null,null,null,null,null,null,"1. Welche Akteure sollen aktiv in den Erarbeitungsprozess einbezogen werden? ",null,null,null,null,null,null,null,"1. Welche Akteure sollen aktiv in den Erarbeitungsprozess einbezogen werden? ",null,null,null,null,null,null,null,"1. Welche Akteure sollen aktiv in den Erarbeitungsprozess einbezogen werden? ",null,null,null,null,null,null,null,"1. Welche Akteure sollen aktiv in den Erarbeitungsprozess einbezogen werden? ",null,null,null,null,null,null,null,"1. Welche Akteure sollen aktiv in den Erarbeitungsprozess einbezogen werden? ",null,null,null,null,null,null,null,"1. Welche Akteure sollen aktiv in den Erarbeitungsprozess einbezogen werden? ",null,null,null,null,null,null,null,"1. Welche Akteure sollen aktiv in den Erarbeitungsprozess einbezogen werden? ",null,null,null,null,null,null,null,"1. Welche Akteure sollen aktiv in den Erarbeitungsprozess einbezogen werden? ",null,null,null,null,null,null,null,"1. Welche Akteure sollen aktiv in den Erarbeitungsprozess einbezogen werden? ",null,null,null,null,null,null,null,"1. Welche Akteure sollen aktiv in den Erarbeitungsprozess einbezogen werden? ",null,null,null,null,null,null,null,"1. Welche Akteure sollen aktiv in den Erarbeitungsprozess einbezogen werden? ",null,null,null,null,null,null,null,"1. Welche Akteure sollen aktiv in den Erarbeitungsprozess einbezogen werden? ",null,null,null,null,null,null,null,"1. Welche Akteure sollen aktiv in den Erarbeitungsprozess einbezogen werden? ",null,null,null,null,null,null,null,"1. Welche Akteure sollen aktiv in den Erarbeitungsprozess einbezogen werden? ",null,null,null,null,null,null,null,"1. Welche Akteure sollen aktiv in den Erarbeitungsprozess einbezogen werden? ",null,null,null,null,null,null,null,"1. Welche Akteure sollen aktiv in den Erarbeitungsprozess einbezogen werden? ",null,null,null,null,null,null,null,"1. Welche Akteure sollen aktiv in den Erarbeitungsprozess einbezogen werden? ",null,null,null,null,null,null,null,"1. Welche Akteure sollen aktiv in den Erarbeitungsprozess einbezogen werden? ",null,null,null,null,null,null,null,"1. Welche Akteure sollen aktiv in den Erarbeitungsprozess einbezogen werden? ",null,null,null,null,null,null,null,"1. Welche Akteure sollen aktiv in den Erarbeitungsprozess einbezogen werden? ",null,null,null,null,null,null,null,"1. Welche Akteure sollen aktiv in den Erarbeitungsprozess einbezogen werden? ",null,null,null,null,null,null,null,"1. Welche Akteure sollen aktiv in den Erarbeitungsprozess einbezogen werden? ",null,null,null,null,null,null,null,"1. Welche Akteure sollen aktiv in den Erarbeitungsprozess einbezogen werden? ",null,null,null,null,null,null,null,"1. Welche Akteure sollen aktiv in den Erarbeitungsprozess einbezogen werden? ",null,null,null,null,null,null,null,"1. Welche Akteure sollen aktiv in den Erarbeitungsprozess einbezogen werden? ",null,null,null,null,null,null,null,"1. Welche Akteure sollen aktiv in den Erarbeitungsprozess einbezogen werden? ",null,null,null,null,null,null,null,"1. Welche Akteure sollen aktiv in den Erarbeitungsprozess einbezogen werden? ",null,null,null,null,null,null,null,"1. Welche Akteure sollen aktiv in den Erarbeitungsprozess einbezogen werden? ",null,null,null,null,null,null,null,"1. Welche Akteure sollen aktiv in den Erarbeitungsprozess einbezogen werden? ",null,null,null,null,null,null,null,"1. Welche Akteure sollen aktiv in den Erarbeitungsprozess einbezogen werden? ",null,null,null,null,null,null,null,"1. Welche Akteure sollen aktiv in den Erarbeitungsprozess einbezogen werden? ",null,null,null,null,null,null,null,"1. Welche Akteure sollen aktiv in den Erarbeitungsprozess einbezogen werden? ",null,null,null,null,null,null,null,"1. Welche Akteure sollen aktiv in den Erarbeitungsprozess einbezogen werden? ",null,null,null,null,null,null,null,"1. Welche Akteure sollen aktiv in den Erarbeitungsprozess einbezogen werden? ",null,null,null,null,null,null,null,"1. Welche Akteure sollen aktiv in den Erarbeitungsprozess einbezogen werden? ",null,null,null,null,null,null,null,"1. Welche Akteure sollen aktiv in den Erarbeitungsprozess einbezogen werden? ",null,null,null,null,null,null,null,"1. Welche Akteure sollen aktiv in den Erarbeitungsprozess einbezogen werden? ",null,null,null,null,null,null,null,"1. Welche Akteure sollen aktiv in den Erarbeitungsprozess einbezogen werden? ",null,null,null,null,null,null,null,"1. Welche Akteure sollen aktiv in den Erarbeitungsprozess einbezogen werden? ",null,null,null,null,null,null,null,"1. Welche Akteure sollen aktiv in den Erarbeitungsprozess einbezogen werden? ",null,null,null,null,null,null,null,"1. Welche Akteure sollen aktiv in den Erarbeitungsprozess einbezogen werden? ",null,null,null,null,null,null,null,"1. Welche Akteure sollen aktiv in den Erarbeitungsprozess einbezogen werden? ",null,null,null,null,null,null,null,"1. Welche Akteure sollen aktiv in den Erarbeitungsprozess einbezogen werden? ",null,null,null,null,null,null,null,"1. Welche Akteure sollen aktiv in den Erarbeitungsprozess einbezogen werden? ",null,null,null,null,null,null,null,"1. Welche Akteure sollen aktiv in den Erarbeitungsprozess einbezogen werden? ",null,null,null,null,null,null,null,"1. Welche Akteure sollen aktiv in den Erarbeitungsprozess einbezogen werden? ",null,null,null,null,null,null,null,"1. Welche Akteure sollen aktiv in den Erarbeitungsprozess einbezogen werden? ",null,null,null,null,null,null,null,"1. Welche Akteure sollen aktiv in den Erarbeitungsprozess einbezogen werden? ",null,null,null,null,null,null,null,"1. Welche Akteure sollen aktiv in den Erarbeitungsprozess einbezogen werden? ",null,null,null,null,null,null,null,"1. Welche Akteure sollen aktiv in den Erarbeitungsprozess einbezogen werden? ",null,null,null,null,null,null,null,"1. Welche Akteure sollen aktiv in den Erarbeitungsprozess einbezogen werden? ",null,null,null,null,null,null,null,"1. Welche Akteure sollen aktiv in den Erarbeitungsprozess einbezogen werden? ",null,null,null,null,null,null,null,"1. Welche Akteure sollen aktiv in den Erarbeitungsprozess einbezogen werden? ",null,null,null,null,null,null,null,"1. Welche Akteure sollen aktiv in den Erarbeitungsprozess einbezogen werden? ",null,null,null,null,null,null,null,"1. Welche Akteure sollen aktiv in den Erarbeitungsprozess einbezogen werden? ",null,null,null,null,null,null,null,"1. Welche Akteure sollen aktiv in den Erarbeitungsprozess einbezogen werden? ",null,null,null,null,null,null,null,"1. Welche Akteure sollen aktiv in den Erarbeitungsprozess einbezogen werden? ",null,null,null,null,null,null,null,"1. Welche Akteure sollen aktiv in den Erarbeitungsprozess einbezogen werden? ",null,null,null,null,null,null,null,"1. Welche Akteure sollen aktiv in den Erarbeitungsprozess einbezogen werden? ",null,null,null,null,null,null,null,"1. Welche Akteure sollen aktiv in den Erarbeitungsprozess einbezogen werden? ",null,null,null,null,null,null,null,"1. Welche Akteure sollen aktiv in den Erarbeitungsprozess einbezogen werden? ",null,null,null,null,null,null,null,"1. Welche Akteure sollen aktiv in den Erarbeitungsprozess einbezogen werden? ",null,null,null,null,null,null,null,"1. Welche Akteure sollen aktiv in den Erarbeitungsprozess einbezogen werden? ",null,null,null,null,null,null,null,"1. Welche Akteure sollen aktiv in den Erarbeitungsprozess einbezogen werden? ",null,null,null,null,null,null,null,"1. Welche Akteure sollen aktiv in den Erarbeitungsprozess einbezogen werden? ",null,null,null,null,null,null,null,"1. Welche Akteure sollen aktiv in den Erarbeitungsprozess einbezogen werden? ",null,null,null,null,null,null,null,"1. Welche Akteure sollen aktiv in den Erarbeitungsprozess einbezogen werden? ",null,null,null,null,null,null,null,"1. Welche Akteure sollen aktiv in den Erarbeitungsprozess einbezogen werden? ",null,null,null,null,null,null,null,"1. Welche Akteure sollen aktiv in den Erarbeitungsprozess einbezogen werden? ",null,null,null,null,null,null,null,"1. Welche Akteure sollen aktiv in den Erarbeitungsprozess einbezogen werden? ",null,null,null,null,null,null,null,"1. Welche Akteure sollen aktiv in den Erarbeitungsprozess einbezogen werden? ",null,null,null,null,null,null,null,"1. Welche Akteure sollen aktiv in den Erarbeitungsprozess einbezogen werden? ",null,null,null,null,null,null,null,"1. Welche Akteure sollen aktiv in den Erarbeitungsprozess einbezogen werden? ",null,null,null,null,null,null,null,"1. Welche Akteure sollen aktiv in den Erarbeitungsprozess einbezogen werden? ",null,null,null,null,null,null,null,"1. Welche Akteure sollen aktiv in den Erarbeitungsprozess einbezogen werden? ",null,null,null,null,null,null,null,"1. Welche Akteure sollen aktiv in den Erarbeitungsprozess einbezogen werden? ",null,null,null,null,null,null,null,"1. Welche Akteure sollen aktiv in den Erarbeitungsprozess einbezogen werden? ",null,null,null,null,null,null,null,"1. Welche Akteure sollen aktiv in den Erarbeitungsprozess einbezogen werden? ",null,null,null,null,null,null,null,"1. Welche Akteure sollen aktiv in den Erarbeitungsprozess einbezogen werden? ",null,null,null,null,null,null,null,"1. Welche Akteure sollen aktiv in den Erarbeitungsprozess einbezogen werden? ",null,null,null,null,null,null,null,"1. Welche Akteure sollen aktiv in den Erarbeitungsprozess einbezogen werden? ",null,null,null,null,null,null,null,"1. Welche Akteure sollen aktiv in den Erarbeitungsprozess einbezogen werden? ",null,null,null,null,null,null,null,"1. Welche Akteure sollen aktiv in den Erarbeitungsprozess einbezogen werden? ",null,null,null,null,null,null,null,"1. Welche Akteure sollen aktiv in den Erarbeitungsprozess einbezogen werden? ",null,null,null,null,null,null,null,"1. Welche Akteure sollen aktiv in den Erarbeitungsprozess einbezogen werden? ",null,null,null,null,null,null,null,"1. Welche Akteure sollen aktiv in den Erarbeitungsprozess einbezogen werden? ",null,null,null,null,null,null,null,"1. Welche Akteure sollen aktiv in den Erarbeitungsprozess einbezogen werden? ",null,null,null,null,null,null,null,"1. Welche Akteure sollen aktiv in den Erarbeitungsprozess einbezogen werden? ",null,null,null,null,null,null,null,"1. Welche Akteure sollen aktiv in den Erarbeitungsprozess einbezogen werden? ",null,null,null,null,null,null,null,"1. Welche Akteure sollen aktiv in den Erarbeitungsprozess einbezogen werden? ",null,null,null,null,null,null,null,"1. Welche Akteure sollen aktiv in den Erarbeitungsprozess einbezogen werden? ",null,null,null,null,null,null,null,"1. Welche Akteure sollen aktiv in den Erarbeitungsprozess einbezogen werden? ",null,null,null,null,null,null,null,"1. Welche Akteure sollen aktiv in den Erarbeitungsprozess einbezogen werden? ",null,null,null,null,null,null,null,"1. Welche Akteure sollen aktiv in den Erarbeitungsprozess einbezogen werden? ",null,null,null,null,null,null,null,"1. Welche Akteure sollen aktiv in den Erarbeitungsprozess einbezogen werden? ",null,null,null,null,null,null,null,"1. Welche Akteure sollen aktiv in den Erarbeitungsprozess einbezogen werden? ",null,null,null,null,null,null,null,"1. Welche Akteure sollen aktiv in den Erarbeitungsprozess einbezogen werden? ",null,null,null,null,null,null,null,"1. Welche Akteure sollen aktiv in den Erarbeitungsprozess einbezogen werden? ",null,null,null,null,null,null,null,"1. Welche Akteure sollen aktiv in den Erarbeitungsprozess einbezogen werden? ",null,null,null,null,null,null,null,"1. Welche Akteure sollen aktiv in den Erarbeitungsprozess einbezogen werden? ",null,null,null,null,null,null,null,"1. Welche Akteure sollen aktiv in den Erarbeitungsprozess einbezogen werden? ",null,null,null,null,null,null,null,"1. Welche Akteure sollen aktiv in den Erarbeitungsprozess einbezogen werden? ",null,null,null,null,null,null,null,"1. Welche Akteure sollen aktiv in den Erarbeitungsprozess einbezogen werden? ",null,null,null,null,null,null,null,"1. Welche Akteure sollen aktiv in den Erarbeitungsprozess einbezogen werden? ",null,null,null,null,null,null,null,"1. Welche Akteure sollen aktiv in den Erarbeitungsprozess einbezogen werden? ",null,null,null,null,null,null,null,"1. Welche Akteure sollen aktiv in den Erarbeitungsprozess einbezogen werden? ",null,null,null,null,null,null,null,"1. Welche Akteure sollen aktiv in den Erarbeitungsprozess einbezogen werden? ",null,null,null,null,null,null,null,"1. Welche Akteure sollen aktiv in den Erarbeitungsprozess einbezogen werden? ",null,null,null,null,null,null,null,"1. Welche Akteure sollen aktiv in den Erarbeitungsprozess einbezogen werden? ",null,null,null,null,null,null,null,"1. Welche Akteure sollen aktiv in den Erarbeitungsprozess einbezogen werden? ",null,null,null,null,null,null,null,"1. Welche Akteure sollen aktiv in den Erarbeitungsprozess einbezogen werden? ",null,null,null,null,null,null,null,"1. Welche Akteure sollen aktiv in den Erarbeitungsprozess einbezogen werden? ",null,null,null,null,null,null,null,"1. Welche Akteure sollen aktiv in den Erarbeitungsprozess einbezogen werden? ",null,null,null,null,null,null,null,"1. Welche Akteure sollen aktiv in den Erarbeitungsprozess einbezogen werden? ",null,null,null,null,null,null,null,"1. Welche Akteure sollen aktiv in den Erarbeitungsprozess einbezogen werden? ",null,null,null,null,null,null,null,"1. Welche Akteure sollen aktiv in den Erarbeitungsprozess einbezogen werden? ",null,null,null,null,null,null,null,"1. Welche Akteure sollen aktiv in den Erarbeitungsprozess einbezogen werden? ",null,null,null,null,null,null,null,"1. Welche Akteure sollen aktiv in den Erarbeitungsprozess einbezogen werden? ",null,null,null,null,null,null,null,"1. Welche Akteure sollen aktiv in den Erarbeitungsprozess einbezogen werden? ",null,null,null,null,null,null,null,"1. Welche Akteure sollen aktiv in den Erarbeitungsprozess einbezogen werden? ",null,null,null,null,null,null,null,"1. Welche Akteure sollen aktiv in den Erarbeitungsprozess einbezogen werden? ",null,null,null,null,null,null,null,"1. Welche Akteure sollen aktiv in den Erarbeitungsprozess einbezogen werden? ",null,null,null,null,null,null,null,"1. Welche Akteure sollen aktiv in den Erarbeitungsprozess einbezogen werden? ",null,null,null,null,null,null,null,"1. Welche Akteure sollen aktiv in den Erarbeitungsprozess einbezogen werden? ",null,null,null,null,null,null,null,"1. Welche Akteure sollen aktiv in den Erarbeitungsprozess einbezogen werden? ",null,null,null,null,null,null,null,"1. Welche Akteure sollen aktiv in den Erarbeitungsprozess einbezogen werden? ",null,null,null,null,null,null,null,"1. Welche Akteure sollen aktiv in den Erarbeitungsprozess einbezogen werden? ",null,null,null,null,null,null,null,"1. Welche Akteure sollen aktiv in den Erarbeitungsprozess einbezogen werden? ",null,null,null,null,null,null,null,"1. Welche Akteure sollen aktiv in den Erarbeitungsprozess einbezogen werden? ",null,null,null,null,null,null,null,"1. Welche Akteure sollen aktiv in den Erarbeitungsprozess einbezogen werden? ",null,null,null,null,null,null,null,"1. Welche Akteure sollen aktiv in den Erarbeitungsprozess einbezogen werden? ",null,null,null,null,null,null,null,"1. Welche Akteure sollen aktiv in den Erarbeitungsprozess einbezogen werden? ",null,null,null,null,null,null,null,"1. Welche Akteure sollen aktiv in den Erarbeitungsprozess einbezogen werden? ",null,null,null,null,null,null,null,"1. Welche Akteure sollen aktiv in den Erarbeitungsprozess einbezogen werden? ",null,null,null,null,null,null,null,"1. Welche Akteure sollen aktiv in den Erarbeitungsprozess einbezogen werden? ",null,null,null,null,null,null,null,"1. Welche Akteure sollen aktiv in den Erarbeitungsprozess einbezogen werden? ",null,null,null,null,null,null,null,"1. Welche Akteure sollen aktiv in den Erarbeitungsprozess einbezogen werden? ",null,null,null,null,null,null,null,"1. Welche Akteure sollen aktiv in den Erarbeitungsprozess einbezogen werden? ",null,null,null,null,null,null,null,"1. Welche Akteure sollen aktiv in den Erarbeitungsprozess einbezogen werden? ",null,null,null,null,null,null,null,"1. Welche Akteure sollen aktiv in den Erarbeitungsprozess einbezogen werden? ",null,null,null,null,null,null,null,"1. Welche Akteure sollen aktiv in den Erarbeitungsprozess einbezogen werden? ",null,null,null,null,null,null,null,"1. Welche Akteure sollen aktiv in den Erarbeitungsprozess einbezogen werden? ",null,null,null,null,null,null,null,"1. Welche Akteure sollen aktiv in den Erarbeitungsprozess einbezogen werden? ",null,null,null,null,null,null,null,"1. Welche Akteure sollen aktiv in den Erarbeitungsprozess einbezogen werden? ",null,null,null,null,null,null,null,"1. Welche Akteure sollen aktiv in den Erarbeitungsprozess einbezogen werden? ",null,null,null,null,null,null,null,"1. Welche Akteure sollen aktiv in den Erarbeitungsprozess einbezogen werden? ",null,null,null,null,null,null,null,"1. Welche Akteure sollen aktiv in den Erarbeitungsprozess einbezogen werden? ",null,null,null,null,null,null,null,"1. Welche Akteure sollen aktiv in den Erarbeitungsprozess einbezogen werden? ",null,null,null,null,null,null,null,"1. Welche Akteure sollen aktiv in den Erarbeitungsprozess einbezogen werden? ",null,null,null,null,null,null,null,"1. Welche Akteure sollen aktiv in den Erarbeitungsprozess einbezogen werden? ",null,null,null,null,null,null,null,"1. Welche Akteure sollen aktiv in den Erarbeitungsprozess einbezogen werden? ",null,null,null,null,null,null,null,"1. Welche Akteure sollen aktiv in den Erarbeitungsprozess einbezogen werden? ",null,null,null,null,null,null,null,"1. Welche Akteure sollen aktiv in den Erarbeitungsprozess einbezogen werden? ",null,null,null,null,null,null,null,"1. Welche Akteure sollen aktiv in den Erarbeitungsprozess einbezogen werden? ",null,null,null,null,null,null,null,"1. Welche Akteure sollen aktiv in den Erarbeitungsprozess einbezogen werden? ",null,null,null,null,null,null,null,"1. Welche Akteure sollen aktiv in den Erarbeitungsprozess einbezogen werden? ",null,null,null,null,null,null,null,"1. Welche Akteure sollen aktiv in den Erarbeitungsprozess einbezogen werden? ",null,null,null,null,null,null,null,"1. Welche Akteure sollen aktiv in den Erarbeitungsprozess einbezogen werden? ",null,null,null,null,null,null,null,"1. Welche Akteure sollen aktiv in den Erarbeitungsprozess einbezogen werden? ",null,null,null,null,null,null,null,"1. Welche Akteure sollen aktiv in den Erarbeitungsprozess einbezogen werden? ",null,null,null,null,null,null,null,"1. Welche Akteure sollen aktiv in den Erarbeitungsprozess einbezogen werden? ",null,null,null,null,null,null,null,"1. Welche Akteure sollen aktiv in den Erarbeitungsprozess einbezogen werden? ",null,null,null,null,null,null,null,"1. Welche Akteure sollen aktiv in den Erarbeitungsprozess einbezogen werden? ",null,null,null,null,null,null,null,"1. Welche Akteure sollen aktiv in den Erarbeitungsprozess einbezogen werden? ",null,null,null,null,null,null,null,"1. Welche Akteure sollen aktiv in den Erarbeitungsprozess einbezogen werden? ",null,null,null,null,null,null,null,"1. Welche Akteure sollen aktiv in den Erarbeitungsprozess einbezogen werden? ",null,null,null,null,null,null,null,"1. Welche Akteure sollen aktiv in den Erarbeitungsprozess einbezogen werden? ",null,null,null,null,null,null,null,"1. Welche Akteure sollen aktiv in den Erarbeitungsprozess einbezogen werden? ",null,null,null,null,null,null,null,"1. Welche Akteure sollen aktiv in den Erarbeitungsprozess einbezogen werden? ",null,null,null,null,null,null,null,"1. Welche Akteure sollen aktiv in den Erarbeitungsprozess einbezogen werden? ",null,null,null,null,null,null,null,"1. Welche Akteure sollen aktiv in den Erarbeitungsprozess einbezogen werden? ",null,null,null,null,null,null,null,"1. Welche Akteure sollen aktiv in den Erarbeitungsprozess einbezogen werden? ",null,null,null,null,null,null,null,"1. Welche Akteure sollen aktiv in den Erarbeitungsprozess einbezogen werden? ",null,null,null,null,null,null,null,"1. Welche Akteure sollen aktiv in den Erarbeitungsprozess einbezogen werden? ",null,null,null,null,null,null,null,"1. Welche Akteure sollen aktiv in den Erarbeitungsprozess einbezogen werden? ",null,null,null,null,null,null,null,"1. Welche Akteure sollen aktiv in den Erarbeitungsprozess einbezogen werden? ",null,null,null,null,null,null,null,"1. Welche Akteure sollen aktiv in den Erarbeitungsprozess einbezogen werden? ",null,null,null,null,null,null,null,"1. Welche Akteure sollen aktiv in den Erarbeitungsprozess einbezogen werden? ",null,null,null,null,null,null,null,"1. Welche Akteure sollen aktiv in den Erarbeitungsprozess einbezogen werden? ",null,null,null,null,null,null,null,"1. Welche Akteure sollen aktiv in den Erarbeitungsprozess einbezogen werden? ",null,null,null,null,null,null,null,"1. Welche Akteure sollen aktiv in den Erarbeitungsprozess einbezogen werden? ",null,null,null,null,null,null,null,"1. Welche Akteure sollen aktiv in den Erarbeitungsprozess einbezogen werden? ",null,null,null,null,null,null,null,"1. Welche Akteure sollen aktiv in den Erarbeitungsprozess einbezogen werden? ",null,null,null,null,null,null,null,"1. Welche Akteure sollen aktiv in den Erarbeitungsprozess einbezogen werden? ",null,null,null,null,null,null,null,"1. Welche Akteure sollen aktiv in den Erarbeitungsprozess einbezogen werden? ",null,null,null,null,null,null,null,"1. Welche Akteure sollen aktiv in den Erarbeitungsprozess einbezogen werden? ",null,null,null,null,null,null,null,"1. Welche Akteure sollen aktiv in den Erarbeitungsprozess einbezogen werden? ",null,null,null,null,null,null,null,"1. Welche Akteure sollen aktiv in den Erarbeitungsprozess einbezogen werden? ",null,null,null,null,null,null,null,"1. Welche Akteure sollen aktiv in den Erarbeitungsprozess einbezogen werden? ",null,null,null,null,null,null,null,"1. Welche Akteure sollen aktiv in den Erarbeitungsprozess einbezogen werden? ",null,null,null,null,null,null,null,"1. Welche Akteure sollen aktiv in den Erarbeitungsprozess einbezogen werden? ",null,null,null,null,null,null,null,"1. Welche Akteure sollen aktiv in den Erarbeitungsprozess einbezogen werden? ",null,null,null,null,null,null,null,"1. Welche Akteure sollen aktiv in den Erarbeitungsprozess einbezogen werden? ",null,null,null,null,null,null,null,"1. Welche Akteure sollen aktiv in den Erarbeitungsprozess einbezogen werden? ",null,null,null,null,null,null,null,"1. Welche Akteure sollen aktiv in den Erarbeitungsprozess einbezogen werden? ",null,null,null,null,null,null,null,"1. Welche Akteure sollen aktiv in den Erarbeitungsprozess einbezogen werden? ",null,null,null,null,null,null,null,"1. Welche Akteure sollen aktiv in den Erarbeitungsprozess einbezogen werden? ",null,null,null,null,null,null,null,"1. Welche Akteure sollen aktiv in den Erarbeitungsprozess einbezogen werden? ",null,null,null,null,null,null,null,"1. Welche Akteure sollen aktiv in den Erarbeitungsprozess einbezogen werden? ",null,null,null,null,null,null,null,"1. Welche Akteure sollen aktiv in den Erarbeitungsprozess einbezogen werden? ",null,null,null,null,null,null,null,"1. Welche Akteure sollen aktiv in den Erarbeitungsprozess einbezogen werden? ",null,null,null,null,null,null,null,"1. Welche Akteure sollen aktiv in den Erarbeitungsprozess einbezogen werden? ",null,null,null,null,null,null,null,"1. Welche Akteure sollen aktiv in den Erarbeitungsprozess einbezogen werden? ",null,null,null,null,null,null,null,"1. Welche Akteure sollen aktiv in den Erarbeitungsprozess einbezogen werden? ",null,null,null,null,null,null,null,"1. Welche Akteure sollen aktiv in den Erarbeitungsprozess einbezogen werden? ",null,null,null,null,null,null,null,"1. Welche Akteure sollen aktiv in den Erarbeitungsprozess einbezogen werden? ",null,null,null,null,null,null,null,"1. Welche Akteure sollen aktiv in den Erarbeitungsprozess einbezogen werden? ",null,null,null,null,null,null,null,"1. Welche Akteure sollen aktiv in den Erarbeitungsprozess einbezogen werden? ",null,null,null,null,null,null,null,"1. Welche Akteure sollen aktiv in den Erarbeitungsprozess einbezogen werden? ",null,null,null,null,null,null,null,"1. Welche Akteure sollen aktiv in den Erarbeitungsprozess einbezogen werden? ",null,null,null,null,null,null,null,"1. Welche Akteure sollen aktiv in den Erarbeitungsprozess einbezogen werden? ",null,null,null,null,null,null,null,"1. Welche Akteure sollen aktiv in den Erarbeitungsprozess einbezogen werden? ",null,null,null,null,null,null,null,"1. Welche Akteure sollen aktiv in den Erarbeitungsprozess einbezogen werden? ",null,null,null,null,null,null,null,"1. Welche Akteure sollen aktiv in den Erarbeitungsprozess einbezogen werden? ",null,null,null,null,null,null,null,"1. Welche Akteure sollen aktiv in den Erarbeitungsprozess einbezogen werden? ",null,null,null,null,null,null,null,"1. Welche Akteure sollen aktiv in den Erarbeitungsprozess einbezogen werden? ",null,null,null,null,null,null,null,"1. Welche Akteure sollen aktiv in den Erarbeitungsprozess einbezogen werden? ",null,null,null,null,null,null,null,"1. Welche Akteure sollen aktiv in den Erarbeitungsprozess einbezogen werden? ",null,null,null,null,null,null,null,"1. Welche Akteure sollen aktiv in den Erarbeitungsprozess einbezogen werden? ",null,null,null,null,null,null,null,"1. Welche Akteure sollen aktiv in den Erarbeitungsprozess einbezogen werden? ",null,null,null,null,null,null,null,"1. Welche Akteure sollen aktiv in den Erarbeitungsprozess einbezogen werden? ",null,null,null,null,null,null,null,"1. Welche Akteure sollen aktiv in den Erarbeitungsprozess einbezogen werden? ",null,null,null,null,null,null,null,"1. Welche Akteure sollen aktiv in den Erarbeitungsprozess einbezogen werden? ",null,null,null,null,null,null,null,"1. Welche Akteure sollen aktiv in den Erarbeitungsprozess einbezogen werden? ",null,null,null,null,null,null,null,"1. Welche Akteure sollen aktiv in den Erarbeitungsprozess einbezogen werden? ",null,null,null,null,null,null,null,"1. Welche Akteure sollen aktiv in den Erarbeitungsprozess einbezogen werden? ",null,null,null,null,null,null,null,"1. Welche Akteure sollen aktiv in den Erarbeitungsprozess einbezogen werden? ",null,null,null,null,null,null,null,"1. Welche Akteure sollen aktiv in den Erarbeitungsprozess einbezogen werden? ",null,null,null,null,null,null,null,"1. Welche Akteure sollen aktiv in den Erarbeitungsprozess einbezogen werden? ",null,null,null,null,null,null,null,"1. Welche Akteure sollen aktiv in den Erarbeitungsprozess einbezogen werden? ",null,null,null,null,null,null,null,"1. Welche Akteure sollen aktiv in den Erarbeitungsprozess einbezogen werden? ",null,null,null,null,null,null,null,"1. Welche Akteure sollen aktiv in den Erarbeitungsprozess einbezogen werden? ",null,null,null,null,null,null,null,"1. Welche Akteure sollen aktiv in den Erarbeitungsprozess einbezogen werden? ",null,null,null,null,null,null,null,"1. Welche Akteure sollen aktiv in den Erarbeitungsprozess einbezogen werden? ",null,null,null,null,null,null,null,"1. Welche Akteure sollen aktiv in den Erarbeitungsprozess einbezogen werden? ",null,null,null,null,null,null,null,"1. Welche Akteure sollen aktiv in den Erarbeitungsprozess einbezogen werden? ",null,null,null,null,null,null,null,"1. Welche Akteure sollen aktiv in den Erarbeitungsprozess einbezogen werden? ",null,null,null,null,null,null,null,"1. Welche Akteure sollen aktiv in den Erarbeitungsprozess einbezogen werden? ",null,null,null,null,null,null,null,"1. Welche Akteure sollen aktiv in den Erarbeitungsprozess einbezogen werden? ",null,null,null,null,null,null,null,"1. Welche Akteure sollen aktiv in den Erarbeitungsprozess einbezogen werden? ",null,null,null,null,null,null,null,"1. Welche Akteure sollen aktiv in den Erarbeitungsprozess einbezogen werden? ",null,null,null,null,null,null,null,"1. Welche Akteure sollen aktiv in den Erarbeitungsprozess einbezogen werden? ",null,null,null,null,null,null,null,"1. Welche Akteure sollen aktiv in den Erarbeitungsprozess einbezogen werden? ",null,null,null,null,null,null,null,"1. Welche Akteure sollen aktiv in den Erarbeitungsprozess einbezogen werden? ",null,null,null,null,null,null,null,"1. Welche Akteure sollen aktiv in den Erarbeitungsprozess einbezogen werden? ",null,null,null,null,null,null,null,"1. Welche Akteure sollen aktiv in den Erarbeitungsprozess einbezogen werden? ",null,null,null,null,null,null,null,"1. Welche Akteure sollen aktiv in den Erarbeitungsprozess einbezogen werden? ",null,null,null,null,null,null,null,"1. Welche Akteure sollen aktiv in den Erarbeitungsprozess einbezogen werden? ",null,null,null,null,null,null,null,"1. Welche Akteure sollen aktiv in den Erarbeitungsprozess einbezogen werden? ",null,null,null,null,null,null,null,"1. Welche Akteure sollen aktiv in den Erarbeitungsprozess einbezogen werden? ",null,null,null,null,null,null,null,"1. Welche Akteure sollen aktiv in den Erarbeitungsprozess einbezogen werden? ",null,null,null,null,null,null,null,"1. Welche Akteure sollen aktiv in den Erarbeitungsprozess einbezogen werden? ",null,null,null,null,null,null,null,"1. Welche Akteure sollen aktiv in den Erarbeitungsprozess einbezogen werden? ",null,null,null,null,null,null,null,"1. Welche Akteure sollen aktiv in den Erarbeitungsprozess einbezogen werden? ",null,null,null,null,null,null,null,"1. Welche Akteure sollen aktiv in den Erarbeitungsprozess einbezogen werden? ",null,null,null,null,null,null,null,"1. Welche Akteure sollen aktiv in den Erarbeitungsprozess einbezogen werden? ",null,null,null,null,null,null,null,"1. Welche Akteure sollen aktiv in den Erarbeitungsprozess einbezogen werden? ",null,null,null,null,null,null,null,"1. Welche Akteure sollen aktiv in den Erarbeitungsprozess einbezogen werden? ",null,null,null,null,null,null,null,"1. Welche Akteure sollen aktiv in den Erarbeitungsprozess einbezogen werden? ",null,null,null,null,null,null,null,"1. Welche Akteure sollen aktiv in den Erarbeitungsprozess einbezogen werden? ",null,null,null,null,null,null,null,"1. Welche Akteure sollen aktiv in den Erarbeitungsprozess einbezogen werden? ",null,null,null,null,null,null,null,"1. Welche Akteure sollen aktiv in den Erarbeitungsprozess einbezogen werden? ",null,null,null,null,null,null,null,"1. Welche Akteure sollen aktiv in den Erarbeitungsprozess einbezogen werden? ",null,null,null,null,null,null,null,"1. Welche Akteure sollen aktiv in den Erarbeitungsprozess einbezogen werden? ",null,null,null,null,null,null,null,"1. Welche Akteure sollen aktiv in den Erarbeitungsprozess einbezogen werden? ",null,null,null,null,null,null,null,"1. Welche Akteure sollen aktiv in den Erarbeitungsprozess einbezogen werden? ",null,null,null,null,null,null,null,"1. Welche Akteure sollen aktiv in den Erarbeitungsprozess einbezogen werden? ",null,null,null,null,null,null,null,"1. Welche Akteure sollen aktiv in den Erarbeitungsprozess einbezogen werden? ",null,null,null,null,null,null,null,"1. Welche Akteure sollen aktiv in den Erarbeitungsprozess einbezogen werden? ",null,null,null,null,null,null,null,"1. Welche Akteure sollen aktiv in den Erarbeitungsprozess einbezogen werden? ",null,null,null,null,null,null,null,"1. Welche Akteure sollen aktiv in den Erarbeitungsprozess einbezogen werden? ",null,null,null,null,null,null,null,"1. Welche Akteure sollen aktiv in den Erarbeitungsprozess einbezogen werden? ",null,null,null,null,null,null,null,"1. Welche Akteure sollen aktiv in den Erarbeitungsprozess einbezogen werden? ",null,null,null,null,null,null,null,"1. Welche Akteure sollen aktiv in den Erarbeitungsprozess einbezogen werden? ",null,null,null,null,null,null,null,"1. Welche Akteure sollen aktiv in den Erarbeitungsprozess einbezogen werden? ",null,null,null,null,null,null,null,"1. Welche Akteure sollen aktiv in den Erarbeitungsprozess einbezogen werden? ",null,null,null,null,null,null,null,"1. Welche Akteure sollen aktiv in den Erarbeitungsprozess einbezogen werden? ",null,null,null,null,null,null,null,"1. Welche Akteure sollen aktiv in den Erarbeitungsprozess einbezogen werden? ",null,null,null,null,null,null,null,"1. Welche Akteure sollen aktiv in den Erarbeitungsprozess einbezogen werden? ",null,null,null,null,null,null,null,"1. Welche Akteure sollen aktiv in den Erarbeitungsprozess einbezogen werden? ",null,null,null,null,null,null,null,"1. Welche Akteure sollen aktiv in den Erarbeitungsprozess einbezogen werden? ",null,null,null,null,null,null,null,"1. Welche Akteure sollen aktiv in den Erarbeitungsprozess einbezogen werden? ",null,null,null,null,null,null,null,"1. Welche Akteure sollen aktiv in den Erarbeitungsprozess einbezogen werden? ",null,null,null,null,null,null,null,"1. Welche Akteure sollen aktiv in den Erarbeitungsprozess einbezogen werden? ",null,null,null,null,null,null,null,"1. Welche Akteure sollen aktiv in den Erarbeitungsprozess einbezogen werden? ",null,null,null,null,null,null,null,"1. Welche Akteure sollen aktiv in den Erarbeitungsprozess einbezogen werden? ",null,null,null,null,null,null,null,"1. Welche Akteure sollen aktiv in den Erarbeitungsprozess einbezogen werden? ",null,null,null,null,null,null,null,"1. Welche Akteure sollen aktiv in den Erarbeitungsprozess einbezogen werden? ",null,null,null,null,null,null,null,"1. Welche Akteure sollen aktiv in den Erarbeitungsprozess einbezogen werden? ",null,null,null,null,null,null,null,"1. Welche Akteure sollen aktiv in den Erarbeitungsprozess einbezogen werden? ",null,null,null,null,null,null,null,"1. Welche Akteure sollen aktiv in den Erarbeitungsprozess einbezogen werden? ",null,null,null,null,null,null,null,"1. Welche Akteure sollen aktiv in den Erarbeitungsprozess einbezogen werden? "]
[null,null,null,null,null,null,null,null,"z.B. Zuständige kantonale Stelle(n) und wichtigste Umsetzungspartner / Partner mit Leistungsverträgen",null,null,null,null,null,null,null,"z.B. Zuständige kantonale Stelle(n) und wichtigste Umsetzungspartner / Partner mit Leistungsverträgen",null,null,null,null,null,null,null,"z.B. Zuständige kantonale Stelle(n) und wichtigste Umsetzungspartner / Partner mit Leistungsverträgen",null,null,null,null,null,null,null,"z.B. Zuständige kantonale Stelle(n) und wichtigste Umsetzungspartner / Partner mit Leistungsverträgen",null,null,null,null,null,null,null,"z.B. Zuständige kantonale Stelle(n) und wichtigste Umsetzungspartner / Partner mit Leistungsverträgen",null,null,null,null,null,null,null,"z.B. Zuständige kantonale Stelle(n) und wichtigste Umsetzungspartner / Partner mit Leistungsverträgen",null,null,null,null,null,null,null,"z.B. Zuständige kantonale Stelle(n) und wichtigste Umsetzungspartner / Partner mit Leistungsverträgen",null,null,null,null,null,null,null,"z.B. Zuständige kantonale Stelle(n) und wichtigste Umsetzungspartner / Partner mit Leistungsverträgen",null,null,null,null,null,null,null,"z.B. Zuständige kantonale Stelle(n) und wichtigste Umsetzungspartner / Partner mit Leistungsverträgen",null,null,null,null,null,null,null,"z.B. Zuständige kantonale Stelle(n) und wichtigste Umsetzungspartner / Partner mit Leistungsverträgen",null,null,null,null,null,null,null,"z.B. Zuständige kantonale Stelle(n) und wichtigste Umsetzungspartner / Partner mit Leistungsverträgen",null,null,null,null,null,null,null,"z.B. Zuständige kantonale Stelle(n) und wichtigste Umsetzungspartner / Partner mit Leistungsverträgen",null,null,null,null,null,null,null,"z.B. Zuständige kantonale Stelle(n) und wichtigste Umsetzungspartner / Partner mit Leistungsverträgen",null,null,null,null,null,null,null,"z.B. Zuständige kantonale Stelle(n) und wichtigste Umsetzungspartner / Partner mit Leistungsverträgen",null,null,null,null,null,null,null,"z.B. Zuständige kantonale Stelle(n) und wichtigste Umsetzungspartner / Partner mit Leistungsverträgen",null,null,null,null,null,null,null,"z.B. Zuständige kantonale Stelle(n) und wichtigste Umsetzungspartner / Partner mit Leistungsverträgen",null,null,null,null,null,null,null,"z.B. Zuständige kantonale Stelle(n) und wichtigste Umsetzungspartner / Partner mit Leistungsverträgen",null,null,null,null,null,null,null,"z.B. Zuständige kantonale Stelle(n) und wichtigste Umsetzungspartner / Partner mit Leistungsverträgen",null,null,null,null,null,null,null,"z.B. Zuständige kantonale Stelle(n) und wichtigste Umsetzungspartner / Partner mit Leistungsverträgen",null,null,null,null,null,null,null,"z.B. Zuständige kantonale Stelle(n) und wichtigste Umsetzungspartner / Partner mit Leistungsverträgen",null,null,null,null,null,null,null,"z.B. Zuständige kantonale Stelle(n) und wichtigste Umsetzungspartner / Partner mit Leistungsverträgen",null,null,null,null,null,null,null,"z.B. Zuständige kantonale Stelle(n) und wichtigste Umsetzungspartner / Partner mit Leistungsverträgen",null,null,null,null,null,null,null,"z.B. Zuständige kantonale Stelle(n) und wichtigste Umsetzungspartner / Partner mit Leistungsverträgen",null,null,null,null,null,null,null,"z.B. Zuständige kantonale Stelle(n) und wichtigste Umsetzungspartner / Partner mit Leistungsverträgen",null,null,null,null,null,null,null,"z.B. Zuständige kantonale Stelle(n) und wichtigste Umsetzungspartner / Partner mit Leistungsverträgen",null,null,null,null,null,null,null,"z.B. Zuständige kantonale Stelle(n) und wichtigste Umsetzungspartner / Partner mit Leistungsverträgen",null,null,null,null,null,null,null,"z.B. Zuständige kantonale Stelle(n) und wichtigste Umsetzungspartner / Partner mit Leistungsverträgen",null,null,null,null,null,null,null,"z.B. Zuständige kantonale Stelle(n) und wichtigste Umsetzungspartner / Partner mit Leistungsverträgen",null,null,null,null,null,null,null,"z.B. Zuständige kantonale Stelle(n) und wichtigste Umsetzungspartner / Partner mit Leistungsverträgen",null,null,null,null,null,null,null,"z.B. Zuständige kantonale Stelle(n) und wichtigste Umsetzungspartner / Partner mit Leistungsverträgen",null,null,null,null,null,null,null,"z.B. Zuständige kantonale Stelle(n) und wichtigste Umsetzungspartner / Partner mit Leistungsverträgen",null,null,null,null,null,null,null,"z.B. Zuständige kantonale Stelle(n) und wichtigste Umsetzungspartner / Partner mit Leistungsverträgen",null,null,null,null,null,null,null,"z.B. Zuständige kantonale Stelle(n) und wichtigste Umsetzungspartner / Partner mit Leistungsverträgen",null,null,null,null,null,null,null,"z.B. Zuständige kantonale Stelle(n) und wichtigste Umsetzungspartner / Partner mit Leistungsverträgen",null,null,null,null,null,null,null,"z.B. Zuständige kantonale Stelle(n) und wichtigste Umsetzungspartner / Partner mit Leistungsverträgen",null,null,null,null,null,null,null,"z.B. Zuständige kantonale Stelle(n) und wichtigste Umsetzungspartner / Partner mit Leistungsverträgen",null,null,null,null,null,null,null,"z.B. Zuständige kantonale Stelle(n) und wichtigste Umsetzungspartner / Partner mit Leistungsverträgen",null,null,null,null,null,null,null,"z.B. Zuständige kantonale Stelle(n) und wichtigste Umsetzungspartner / Partner mit Leistungsverträgen",null,null,null,null,null,null,null,"z.B. Zuständige kantonale Stelle(n) und wichtigste Umsetzungspartner / Partner mit Leistungsverträgen",null,null,null,null,null,null,null,"z.B. Zuständige kantonale Stelle(n) und wichtigste Umsetzungspartner / Partner mit Leistungsverträgen",null,null,null,null,null,null,null,"z.B. Zuständige kantonale Stelle(n) und wichtigste Umsetzungspartner / Partner mit Leistungsverträgen",null,null,null,null,null,null,null,"z.B. Zuständige kantonale Stelle(n) und wichtigste Umsetzungspartner / Partner mit Leistungsverträgen",null,null,null,null,null,null,null,"z.B. Zuständige kantonale Stelle(n) und wichtigste Umsetzungspartner / Partner mit Leistungsverträgen",null,null,null,null,null,null,null,"z.B. Zuständige kantonale Stelle(n) und wichtigste Umsetzungspartner / Partner mit Leistungsverträgen",null,null,null,null,null,null,null,"z.B. Zuständige kantonale Stelle(n) und wichtigste Umsetzungspartner / Partner mit Leistungsverträgen",null,null,null,null,null,null,null,"z.B. Zuständige kantonale Stelle(n) und wichtigste Umsetzungspartner / Partner mit Leistungsverträgen",null,null,null,null,null,null,null,"z.B. Zuständige kantonale Stelle(n) und wichtigste Umsetzungspartner / Partner mit Leistungsverträgen",null,null,null,null,null,null,null,"z.B. Zuständige kantonale Stelle(n) und wichtigste Umsetzungspartner / Partner mit Leistungsverträgen",null,null,null,null,null,null,null,"z.B. Zuständige kantonale Stelle(n) und wichtigste Umsetzungspartner / Partner mit Leistungsverträgen",null,null,null,null,null,null,null,"z.B. Zuständige kantonale Stelle(n) und wichtigste Umsetzungspartner / Partner mit Leistungsverträgen",null,null,null,null,null,null,null,"z.B. Zuständige kantonale Stelle(n) und wichtigste Umsetzungspartner / Partner mit Leistungsverträgen",null,null,null,null,null,null,null,"z.B. Zuständige kantonale Stelle(n) und wichtigste Umsetzungspartner / Partner mit Leistungsverträgen",null,null,null,null,null,null,null,"z.B. Zuständige kantonale Stelle(n) und wichtigste Umsetzungspartner / Partner mit Leistungsverträgen",null,null,null,null,null,null,null,"z.B. Zuständige kantonale Stelle(n) und wichtigste Umsetzungspartner / Partner mit Leistungsverträgen",null,null,null,null,null,null,null,"z.B. Zuständige kantonale Stelle(n) und wichtigste Umsetzungspartner / Partner mit Leistungsverträgen",null,null,null,null,null,null,null,"z.B. Zuständige kantonale Stelle(n) und wichtigste Umsetzungspartner / Partner mit Leistungsverträgen",null,null,null,null,null,null,null,"z.B. Zuständige kantonale Stelle(n) und wichtigste Umsetzungspartner / Partner mit Leistungsverträgen",null,null,null,null,null,null,null,"z.B. Zuständige kantonale Stelle(n) und wichtigste Umsetzungspartner / Partner mit Leistungsverträgen",null,null,null,null,null,null,null,"z.B. Zuständige kantonale Stelle(n) und wichtigste Umsetzungspartner / Partner mit Leistungsverträgen",null,null,null,null,null,null,null,"z.B. Zuständige kantonale Stelle(n) und wichtigste Umsetzungspartner / Partner mit Leistungsverträgen",null,null,null,null,null,null,null,"z.B. Zuständige kantonale Stelle(n) und wichtigste Umsetzungspartner / Partner mit Leistungsverträgen",null,null,null,null,null,null,null,"z.B. Zuständige kantonale Stelle(n) und wichtigste Umsetzungspartner / Partner mit Leistungsverträgen",null,null,null,null,null,null,null,"z.B. Zuständige kantonale Stelle(n) und wichtigste Umsetzungspartner / Partner mit Leistungsverträgen",null,null,null,null,null,null,null,"z.B. Zuständige kantonale Stelle(n) und wichtigste Umsetzungspartner / Partner mit Leistungsverträgen",null,null,null,null,null,null,null,"z.B. Zuständige kantonale Stelle(n) und wichtigste Umsetzungspartner / Partner mit Leistungsverträgen",null,null,null,null,null,null,null,"z.B. Zuständige kantonale Stelle(n) und wichtigste Umsetzungspartner / Partner mit Leistungsverträgen",null,null,null,null,null,null,null,"z.B. Zuständige kantonale Stelle(n) und wichtigste Umsetzungspartner / Partner mit Leistungsverträgen",null,null,null,null,null,null,null,"z.B. Zuständige kantonale Stelle(n) und wichtigste Umsetzungspartner / Partner mit Leistungsverträgen",null,null,null,null,null,null,null,"z.B. Zuständige kantonale Stelle(n) und wichtigste Umsetzungspartner / Partner mit Leistungsverträgen",null,null,null,null,null,null,null,"z.B. Zuständige kantonale Stelle(n) und wichtigste Umsetzungspartner / Partner mit Leistungsverträgen",null,null,null,null,null,null,null,"z.B. Zuständige kantonale Stelle(n) und wichtigste Umsetzungspartner / Partner mit Leistungsverträgen",null,null,null,null,null,null,null,"z.B. Zuständige kantonale Stelle(n) und wichtigste Umsetzungspartner / Partner mit Leistungsverträgen",null,null,null,null,null,null,null,"z.B. Zuständige kantonale Stelle(n) und wichtigste Umsetzungspartner / Partner mit Leistungsverträgen",null,null,null,null,null,null,null,"z.B. Zuständige kantonale Stelle(n) und wichtigste Umsetzungspartner / Partner mit Leistungsverträgen",null,null,null,null,null,null,null,"z.B. Zuständige kantonale Stelle(n) und wichtigste Umsetzungspartner / Partner mit Leistungsverträgen",null,null,null,null,null,null,null,"z.B. Zuständige kantonale Stelle(n) und wichtigste Umsetzungspartner / Partner mit Leistungsverträgen",null,null,null,null,null,null,null,"z.B. Zuständige kantonale Stelle(n) und wichtigste Umsetzungspartner / Partner mit Leistungsverträgen",null,null,null,null,null,null,null,"z.B. Zuständige kantonale Stelle(n) und wichtigste Umsetzungspartner / Partner mit Leistungsverträgen",null,null,null,null,null,null,null,"z.B. Zuständige kantonale Stelle(n) und wichtigste Umsetzungspartner / Partner mit Leistungsverträgen",null,null,null,null,null,null,null,"z.B. Zuständige kantonale Stelle(n) und wichtigste Umsetzungspartner / Partner mit Leistungsverträgen",null,null,null,null,null,null,null,"z.B. Zuständige kantonale Stelle(n) und wichtigste Umsetzungspartner / Partner mit Leistungsverträgen",null,null,null,null,null,null,null,"z.B. Zuständige kantonale Stelle(n) und wichtigste Umsetzungspartner / Partner mit Leistungsverträgen",null,null,null,null,null,null,null,"z.B. Zuständige kantonale Stelle(n) und wichtigste Umsetzungspartner / Partner mit Leistungsverträgen",null,null,null,null,null,null,null,"z.B. Zuständige kantonale Stelle(n) und wichtigste Umsetzungspartner / Partner mit Leistungsverträgen",null,null,null,null,null,null,null,"z.B. Zuständige kantonale Stelle(n) und wichtigste Umsetzungspartner / Partner mit Leistungsverträgen",null,null,null,null,null,null,null,"z.B. Zuständige kantonale Stelle(n) und wichtigste Umsetzungspartner / Partner mit Leistungsverträgen",null,null,null,null,null,null,null,"z.B. Zuständige kantonale Stelle(n) und wichtigste Umsetzungspartner / Partner mit Leistungsverträgen",null,null,null,null,null,null,null,"z.B. Zuständige kantonale Stelle(n) und wichtigste Umsetzungspartner / Partner mit Leistungsverträgen",null,null,null,null,null,null,null,"z.B. Zuständige kantonale Stelle(n) und wichtigste Umsetzungspartner / Partner mit Leistungsverträgen",null,null,null,null,null,null,null,"z.B. Zuständige kantonale Stelle(n) und wichtigste Umsetzungspartner / Partner mit Leistungsverträgen",null,null,null,null,null,null,null,"z.B. Zuständige kantonale Stelle(n) und wichtigste Umsetzungspartner / Partner mit Leistungsverträgen",null,null,null,null,null,null,null,"z.B. Zuständige kantonale Stelle(n) und wichtigste Umsetzungspartner / Partner mit Leistungsverträgen",null,null,null,null,null,null,null,"z.B. Zuständige kantonale Stelle(n) und wichtigste Umsetzungspartner / Partner mit Leistungsverträgen",null,null,null,null,null,null,null,"z.B. Zuständige kantonale Stelle(n) und wichtigste Umsetzungspartner / Partner mit Leistungsverträgen",null,null,null,null,null,null,null,"z.B. Zuständige kantonale Stelle(n) und wichtigste Umsetzungspartner / Partner mit Leistungsverträgen",null,null,null,null,null,null,null,"z.B. Zuständige kantonale Stelle(n) und wichtigste Umsetzungspartner / Partner mit Leistungsverträgen",null,null,null,null,null,null,null,"z.B. Zuständige kantonale Stelle(n) und wichtigste Umsetzungspartner / Partner mit Leistungsverträgen",null,null,null,null,null,null,null,"z.B. Zuständige kantonale Stelle(n) und wichtigste Umsetzungspartner / Partner mit Leistungsverträgen",null,null,null,null,null,null,null,"z.B. Zuständige kantonale Stelle(n) und wichtigste Umsetzungspartner / Partner mit Leistungsverträgen",null,null,null,null,null,null,null,"z.B. Zuständige kantonale Stelle(n) und wichtigste Umsetzungspartner / Partner mit Leistungsverträgen",null,null,null,null,null,null,null,"z.B. Zuständige kantonale Stelle(n) und wichtigste Umsetzungspartner / Partner mit Leistungsverträgen",null,null,null,null,null,null,null,"z.B. Zuständige kantonale Stelle(n) und wichtigste Umsetzungspartner / Partner mit Leistungsverträgen",null,null,null,null,null,null,null,"z.B. Zuständige kantonale Stelle(n) und wichtigste Umsetzungspartner / Partner mit Leistungsverträgen",null,null,null,null,null,null,null,"z.B. Zuständige kantonale Stelle(n) und wichtigste Umsetzungspartner / Partner mit Leistungsverträgen",null,null,null,null,null,null,null,"z.B. Zuständige kantonale Stelle(n) und wichtigste Umsetzungspartner / Partner mit Leistungsverträgen",null,null,null,null,null,null,null,"z.B. Zuständige kantonale Stelle(n) und wichtigste Umsetzungspartner / Partner mit Leistungsverträgen",null,null,null,null,null,null,null,"z.B. Zuständige kantonale Stelle(n) und wichtigste Umsetzungspartner / Partner mit Leistungsverträgen",null,null,null,null,null,null,null,"z.B. Zuständige kantonale Stelle(n) und wichtigste Umsetzungspartner / Partner mit Leistungsverträgen",null,null,null,null,null,null,null,"z.B. Zuständige kantonale Stelle(n) und wichtigste Umsetzungspartner / Partner mit Leistungsverträgen",null,null,null,null,null,null,null,"z.B. Zuständige kantonale Stelle(n) und wichtigste Umsetzungspartner / Partner mit Leistungsverträgen",null,null,null,null,null,null,null,"z.B. Zuständige kantonale Stelle(n) und wichtigste Umsetzungspartner / Partner mit Leistungsverträgen",null,null,null,null,null,null,null,"z.B. Zuständige kantonale Stelle(n) und wichtigste Umsetzungspartner / Partner mit Leistungsverträgen",null,null,null,null,null,null,null,"z.B. Zuständige kantonale Stelle(n) und wichtigste Umsetzungspartner / Partner mit Leistungsverträgen",null,null,null,null,null,null,null,"z.B. Zuständige kantonale Stelle(n) und wichtigste Umsetzungspartner / Partner mit Leistungsverträgen",null,null,null,null,null,null,null,"z.B. Zuständige kantonale Stelle(n) und wichtigste Umsetzungspartner / Partner mit Leistungsverträgen",null,null,null,null,null,null,null,"z.B. Zuständige kantonale Stelle(n) und wichtigste Umsetzungspartner / Partner mit Leistungsverträgen",null,null,null,null,null,null,null,"z.B. Zuständige kantonale Stelle(n) und wichtigste Umsetzungspartner / Partner mit Leistungsverträgen",null,null,null,null,null,null,null,"z.B. Zuständige kantonale Stelle(n) und wichtigste Umsetzungspartner / Partner mit Leistungsverträgen",null,null,null,null,null,null,null,"z.B. Zuständige kantonale Stelle(n) und wichtigste Umsetzungspartner / Partner mit Leistungsverträgen",null,null,null,null,null,null,null,"z.B. Zuständige kantonale Stelle(n) und wichtigste Umsetzungspartner / Partner mit Leistungsverträgen",null,null,null,null,null,null,null,"z.B. Zuständige kantonale Stelle(n) und wichtigste Umsetzungspartner / Partner mit Leistungsverträgen",null,null,null,null,null,null,null,"z.B. Zuständige kantonale Stelle(n) und wichtigste Umsetzungspartner / Partner mit Leistungsverträgen",null,null,null,null,null,null,null,"z.B. Zuständige kantonale Stelle(n) und wichtigste Umsetzungspartner / Partner mit Leistungsverträgen",null,null,null,null,null,null,null,"z.B. Zuständige kantonale Stelle(n) und wichtigste Umsetzungspartner / Partner mit Leistungsverträgen",null,null,null,null,null,null,null,"z.B. Zuständige kantonale Stelle(n) und wichtigste Umsetzungspartner / Partner mit Leistungsverträgen",null,null,null,null,null,null,null,"z.B. Zuständige kantonale Stelle(n) und wichtigste Umsetzungspartner / Partner mit Leistungsverträgen",null,null,null,null,null,null,null,"z.B. Zuständige kantonale Stelle(n) und wichtigste Umsetzungspartner / Partner mit Leistungsverträgen",null,null,null,null,null,null,null,"z.B. Zuständige kantonale Stelle(n) und wichtigste Umsetzungspartner / Partner mit Leistungsverträgen",null,null,null,null,null,null,null,"z.B. Zuständige kantonale Stelle(n) und wichtigste Umsetzungspartner / Partner mit Leistungsverträgen",null,null,null,null,null,null,null,"z.B. Zuständige kantonale Stelle(n) und wichtigste Umsetzungspartner / Partner mit Leistungsverträgen",null,null,null,null,null,null,null,"z.B. Zuständige kantonale Stelle(n) und wichtigste Umsetzungspartner / Partner mit Leistungsverträgen",null,null,null,null,null,null,null,"z.B. Zuständige kantonale Stelle(n) und wichtigste Umsetzungspartner / Partner mit Leistungsverträgen",null,null,null,null,null,null,null,"z.B. Zuständige kantonale Stelle(n) und wichtigste Umsetzungspartner / Partner mit Leistungsverträgen",null,null,null,null,null,null,null,"z.B. Zuständige kantonale Stelle(n) und wichtigste Umsetzungspartner / Partner mit Leistungsverträgen",null,null,null,null,null,null,null,"z.B. Zuständige kantonale Stelle(n) und wichtigste Umsetzungspartner / Partner mit Leistungsverträgen",null,null,null,null,null,null,null,"z.B. Zuständige kantonale Stelle(n) und wichtigste Umsetzungspartner / Partner mit Leistungsverträgen",null,null,null,null,null,null,null,"z.B. Zuständige kantonale Stelle(n) und wichtigste Umsetzungspartner / Partner mit Leistungsverträgen",null,null,null,null,null,null,null,"z.B. Zuständige kantonale Stelle(n) und wichtigste Umsetzungspartner / Partner mit Leistungsverträgen",null,null,null,null,null,null,null,"z.B. Zuständige kantonale Stelle(n) und wichtigste Umsetzungspartner / Partner mit Leistungsverträgen",null,null,null,null,null,null,null,"z.B. Zuständige kantonale Stelle(n) und wichtigste Umsetzungspartner / Partner mit Leistungsverträgen",null,null,null,null,null,null,null,"z.B. Zuständige kantonale Stelle(n) und wichtigste Umsetzungspartner / Partner mit Leistungsverträgen",null,null,null,null,null,null,null,"z.B. Zuständige kantonale Stelle(n) und wichtigste Umsetzungspartner / Partner mit Leistungsverträgen",null,null,null,null,null,null,null,"z.B. Zuständige kantonale Stelle(n) und wichtigste Umsetzungspartner / Partner mit Leistungsverträgen",null,null,null,null,null,null,null,"z.B. Zuständige kantonale Stelle(n) und wichtigste Umsetzungspartner / Partner mit Leistungsverträgen",null,null,null,null,null,null,null,"z.B. Zuständige kantonale Stelle(n) und wichtigste Umsetzungspartner / Partner mit Leistungsverträgen",null,null,null,null,null,null,null,"z.B. Zuständige kantonale Stelle(n) und wichtigste Umsetzungspartner / Partner mit Leistungsverträgen",null,null,null,null,null,null,null,"z.B. Zuständige kantonale Stelle(n) und wichtigste Umsetzungspartner / Partner mit Leistungsverträgen",null,null,null,null,null,null,null,"z.B. Zuständige kantonale Stelle(n) und wichtigste Umsetzungspartner / Partner mit Leistungsverträgen",null,null,null,null,null,null,null,"z.B. Zuständige kantonale Stelle(n) und wichtigste Umsetzungspartner / Partner mit Leistungsverträgen",null,null,null,null,null,null,null,"z.B. Zuständige kantonale Stelle(n) und wichtigste Umsetzungspartner / Partner mit Leistungsverträgen",null,null,null,null,null,null,null,"z.B. Zuständige kantonale Stelle(n) und wichtigste Umsetzungspartner / Partner mit Leistungsverträgen",null,null,null,null,null,null,null,"z.B. Zuständige kantonale Stelle(n) und wichtigste Umsetzungspartner / Partner mit Leistungsverträgen",null,null,null,null,null,null,null,"z.B. Zuständige kantonale Stelle(n) und wichtigste Umsetzungspartner / Partner mit Leistungsverträgen",null,null,null,null,null,null,null,"z.B. Zuständige kantonale Stelle(n) und wichtigste Umsetzungspartner / Partner mit Leistungsverträgen",null,null,null,null,null,null,null,"z.B. Zuständige kantonale Stelle(n) und wichtigste Umsetzungspartner / Partner mit Leistungsverträgen",null,null,null,null,null,null,null,"z.B. Zuständige kantonale Stelle(n) und wichtigste Umsetzungspartner / Partner mit Leistungsverträgen",null,null,null,null,null,null,null,"z.B. Zuständige kantonale Stelle(n) und wichtigste Umsetzungspartner / Partner mit Leistungsverträgen",null,null,null,null,null,null,null,"z.B. Zuständige kantonale Stelle(n) und wichtigste Umsetzungspartner / Partner mit Leistungsverträgen",null,null,null,null,null,null,null,"z.B. Zuständige kantonale Stelle(n) und wichtigste Umsetzungspartner / Partner mit Leistungsverträgen",null,null,null,null,null,null,null,"z.B. Zuständige kantonale Stelle(n) und wichtigste Umsetzungspartner / Partner mit Leistungsverträgen",null,null,null,null,null,null,null,"z.B. Zuständige kantonale Stelle(n) und wichtigste Umsetzungspartner / Partner mit Leistungsverträgen",null,null,null,null,null,null,null,"z.B. Zuständige kantonale Stelle(n) und wichtigste Umsetzungspartner / Partner mit Leistungsverträgen",null,null,null,null,null,null,null,"z.B. Zuständige kantonale Stelle(n) und wichtigste Umsetzungspartner / Partner mit Leistungsverträgen",null,null,null,null,null,null,null,"z.B. Zuständige kantonale Stelle(n) und wichtigste Umsetzungspartner / Partner mit Leistungsverträgen",null,null,null,null,null,null,null,"z.B. Zuständige kantonale Stelle(n) und wichtigste Umsetzungspartner / Partner mit Leistungsverträgen",null,null,null,null,null,null,null,"z.B. Zuständige kantonale Stelle(n) und wichtigste Umsetzungspartner / Partner mit Leistungsverträgen",null,null,null,null,null,null,null,"z.B. Zuständige kantonale Stelle(n) und wichtigste Umsetzungspartner / Partner mit Leistungsverträgen",null,null,null,null,null,null,null,"z.B. Zuständige kantonale Stelle(n) und wichtigste Umsetzungspartner / Partner mit Leistungsverträgen",null,null,null,null,null,null,null,"z.B. Zuständige kantonale Stelle(n) und wichtigste Umsetzungspartner / Partner mit Leistungsverträgen",null,null,null,null,null,null,null,"z.B. Zuständige kantonale Stelle(n) und wichtigste Umsetzungspartner / Partner mit Leistungsverträgen",null,null,null,null,null,null,null,"z.B. Zuständige kantonale Stelle(n) und wichtigste Umsetzungspartner / Partner mit Leistungsverträgen",null,null,null,null,null,null,null,"z.B. Zuständige kantonale Stelle(n) und wichtigste Umsetzungspartner / Partner mit Leistungsverträgen",null,null,null,null,null,null,null,"z.B. Zuständige kantonale Stelle(n) und wichtigste Umsetzungspartner / Partner mit Leistungsverträgen",null,null,null,null,null,null,null,"z.B. Zuständige kantonale Stelle(n) und wichtigste Umsetzungspartner / Partner mit Leistungsverträgen",null,null,null,null,null,null,null,"z.B. Zuständige kantonale Stelle(n) und wichtigste Umsetzungspartner / Partner mit Leistungsverträgen",null,null,null,null,null,null,null,"z.B. Zuständige kantonale Stelle(n) und wichtigste Umsetzungspartner / Partner mit Leistungsverträgen",null,null,null,null,null,null,null,"z.B. Zuständige kantonale Stelle(n) und wichtigste Umsetzungspartner / Partner mit Leistungsverträgen",null,null,null,null,null,null,null,"z.B. Zuständige kantonale Stelle(n) und wichtigste Umsetzungspartner / Partner mit Leistungsverträgen",null,null,null,null,null,null,null,"z.B. Zuständige kantonale Stelle(n) und wichtigste Umsetzungspartner / Partner mit Leistungsverträgen",null,null,null,null,null,null,null,"z.B. Zuständige kantonale Stelle(n) und wichtigste Umsetzungspartner / Partner mit Leistungsverträgen",null,null,null,null,null,null,null,"z.B. Zuständige kantonale Stelle(n) und wichtigste Umsetzungspartner / Partner mit Leistungsverträgen",null,null,null,null,null,null,null,"z.B. Zuständige kantonale Stelle(n) und wichtigste Umsetzungspartner / Partner mit Leistungsverträgen",null,null,null,null,null,null,null,"z.B. Zuständige kantonale Stelle(n) und wichtigste Umsetzungspartner / Partner mit Leistungsverträgen",null,null,null,null,null,null,null,"z.B. Zuständige kantonale Stelle(n) und wichtigste Umsetzungspartner / Partner mit Leistungsverträgen",null,null,null,null,null,null,null,"z.B. Zuständige kantonale Stelle(n) und wichtigste Umsetzungspartner / Partner mit Leistungsverträgen",null,null,null,null,null,null,null,"z.B. Zuständige kantonale Stelle(n) und wichtigste Umsetzungspartner / Partner mit Leistungsverträgen",null,null,null,null,null,null,null,"z.B. Zuständige kantonale Stelle(n) und wichtigste Umsetzungspartner / Partner mit Leistungsverträgen",null,null,null,null,null,null,null,"z.B. Zuständige kantonale Stelle(n) und wichtigste Umsetzungspartner / Partner mit Leistungsverträgen",null,null,null,null,null,null,null,"z.B. Zuständige kantonale Stelle(n) und wichtigste Umsetzungspartner / Partner mit Leistungsverträgen",null,null,null,null,null,null,null,"z.B. Zuständige kantonale Stelle(n) und wichtigste Umsetzungspartner / Partner mit Leistungsverträgen",null,null,null,null,null,null,null,"z.B. Zuständige kantonale Stelle(n) und wichtigste Umsetzungspartner / Partner mit Leistungsverträgen",null,null,null,null,null,null,null,"z.B. Zuständige kantonale Stelle(n) und wichtigste Umsetzungspartner / Partner mit Leistungsverträgen",null,null,null,null,null,null,null,"z.B. Zuständige kantonale Stelle(n) und wichtigste Umsetzungspartner / Partner mit Leistungsverträgen",null,null,null,null,null,null,null,"z.B. Zuständige kantonale Stelle(n) und wichtigste Umsetzungspartner / Partner mit Leistungsverträgen",null,null,null,null,null,null,null,"z.B. Zuständige kantonale Stelle(n) und wichtigste Umsetzungspartner / Partner mit Leistungsverträgen",null,null,null,null,null,null,null,"z.B. Zuständige kantonale Stelle(n) und wichtigste Umsetzungspartner / Partner mit Leistungsverträgen",null,null,null,null,null,null,null,"z.B. Zuständige kantonale Stelle(n) und wichtigste Umsetzungspartner / Partner mit Leistungsverträgen",null,null,null,null,null,null,null,"z.B. Zuständige kantonale Stelle(n) und wichtigste Umsetzungspartner / Partner mit Leistungsverträgen",null,null,null,null,null,null,null,"z.B. Zuständige kantonale Stelle(n) und wichtigste Umsetzungspartner / Partner mit Leistungsverträgen",null,null,null,null,null,null,null,"z.B. Zuständige kantonale Stelle(n) und wichtigste Umsetzungspartner / Partner mit Leistungsverträgen",null,null,null,null,null,null,null,"z.B. Zuständige kantonale Stelle(n) und wichtigste Umsetzungspartner / Partner mit Leistungsverträgen",null,null,null,null,null,null,null,"z.B. Zuständige kantonale Stelle(n) und wichtigste Umsetzungspartner / Partner mit Leistungsverträgen",null,null,null,null,null,null,null,"z.B. Zuständige kantonale Stelle(n) und wichtigste Umsetzungspartner / Partner mit Leistungsverträgen",null,null,null,null,null,null,null,"z.B. Zuständige kantonale Stelle(n) und wichtigste Umsetzungspartner / Partner mit Leistungsverträgen",null,null,null,null,null,null,null,"z.B. Zuständige kantonale Stelle(n) und wichtigste Umsetzungspartner / Partner mit Leistungsverträgen",null,null,null,null,null,null,null,"z.B. Zuständige kantonale Stelle(n) und wichtigste Umsetzungspartner / Partner mit Leistungsverträgen",null,null,null,null,null,null,null,"z.B. Zuständige kantonale Stelle(n) und wichtigste Umsetzungspartner / Partner mit Leistungsverträgen",null,null,null,null,null,null,null,"z.B. Zuständige kantonale Stelle(n) und wichtigste Umsetzungspartner / Partner mit Leistungsverträgen",null,null,null,null,null,null,null,"z.B. Zuständige kantonale Stelle(n) und wichtigste Umsetzungspartner / Partner mit Leistungsverträgen",null,null,null,null,null,null,null,"z.B. Zuständige kantonale Stelle(n) und wichtigste Umsetzungspartner / Partner mit Leistungsverträgen",null,null,null,null,null,null,null,"z.B. Zuständige kantonale Stelle(n) und wichtigste Umsetzungspartner / Partner mit Leistungsverträgen",null,null,null,null,null,null,null,"z.B. Zuständige kantonale Stelle(n) und wichtigste Umsetzungspartner / Partner mit Leistungsverträgen",null,null,null,null,null,null,null,"z.B. Zuständige kantonale Stelle(n) und wichtigste Umsetzungspartner / Partner mit Leistungsverträgen",null,null,null,null,null,null,null,"z.B. Zuständige kantonale Stelle(n) und wichtigste Umsetzungspartner / Partner mit Leistungsverträgen",null,null,null,null,null,null,null,"z.B. Zuständige kantonale Stelle(n) und wichtigste Umsetzungspartner / Partner mit Leistungsverträgen",null,null,null,null,null,null,null,"z.B. Zuständige kantonale Stelle(n) und wichtigste Umsetzungspartner / Partner mit Leistungsverträgen",null,null,null,null,null,null,null,"z.B. Zuständige kantonale Stelle(n) und wichtigste Umsetzungspartner / Partner mit Leistungsverträgen",null,null,null,null,null,null,null,"z.B. Zuständige kantonale Stelle(n) und wichtigste Umsetzungspartner / Partner mit Leistungsverträgen",null,null,null,null,null,null,null,"z.B. Zuständige kantonale Stelle(n) und wichtigste Umsetzungspartner / Partner mit Leistungsverträgen",null,null,null,null,null,null,null,"z.B. Zuständige kantonale Stelle(n) und wichtigste Umsetzungspartner / Partner mit Leistungsverträgen",null,null,null,null,null,null,null,"z.B. Zuständige kantonale Stelle(n) und wichtigste Umsetzungspartner / Partner mit Leistungsverträgen",null,null,null,null,null,null,null,"z.B. Zuständige kantonale Stelle(n) und wichtigste Umsetzungspartner / Partner mit Leistungsverträgen",null,null,null,null,null,null,null,"z.B. Zuständige kantonale Stelle(n) und wichtigste Umsetzungspartner / Partner mit Leistungsverträgen",null,null,null,null,null,null,null,"z.B. Zuständige kantonale Stelle(n) und wichtigste Umsetzungspartner / Partner mit Leistungsverträgen",null,null,null,null,null,null,null,"z.B. Zuständige kantonale Stelle(n) und wichtigste Umsetzungspartner / Partner mit Leistungsverträgen",null,null,null,null,null,null,null,"z.B. Zuständige kantonale Stelle(n) und wichtigste Umsetzungspartner / Partner mit Leistungsverträgen",null,null,null,null,null,null,null,"z.B. Zuständige kantonale Stelle(n) und wichtigste Umsetzungspartner / Partner mit Leistungsverträgen",null,null,null,null,null,null,null,"z.B. Zuständige kantonale Stelle(n) und wichtigste Umsetzungspartner / Partner mit Leistungsverträgen",null,null,null,null,null,null,null,"z.B. Zuständige kantonale Stelle(n) und wichtigste Umsetzungspartner / Partner mit Leistungsverträgen",null,null,null,null,null,null,null,"z.B. Zuständige kantonale Stelle(n) und wichtigste Umsetzungspartner / Partner mit Leistungsverträgen",null,null,null,null,null,null,null,"z.B. Zuständige kantonale Stelle(n) und wichtigste Umsetzungspartner / Partner mit Leistungsverträgen",null,null,null,null,null,null,null,"z.B. Zuständige kantonale Stelle(n) und wichtigste Umsetzungspartner / Partner mit Leistungsverträgen",null,null,null,null,null,null,null,"z.B. Zuständige kantonale Stelle(n) und wichtigste Umsetzungspartner / Partner mit Leistungsverträgen",null,null,null,null,null,null,null,"z.B. Zuständige kantonale Stelle(n) und wichtigste Umsetzungspartner / Partner mit Leistungsverträgen",null,null,null,null,null,null,null,"z.B. Zuständige kantonale Stelle(n) und wichtigste Umsetzungspartner / Partner mit Leistungsverträgen",null,null,null,null,null,null,null,"z.B. Zuständige kantonale Stelle(n) und wichtigste Umsetzungspartner / Partner mit Leistungsverträgen",null,null,null,null,null,null,null,"z.B. Zuständige kantonale Stelle(n) und wichtigste Umsetzungspartner / Partner mit Leistungsverträgen",null,null,null,null,null,null,null,"z.B. Zuständige kantonale Stelle(n) und wichtigste Umsetzungspartner / Partner mit Leistungsverträgen",null,null,null,null,null,null,null,"z.B. Zuständige kantonale Stelle(n) und wichtigste Umsetzungspartner / Partner mit Leistungsverträgen",null,null,null,null,null,null,null,"z.B. Zuständige kantonale Stelle(n) und wichtigste Umsetzungspartner / Partner mit Leistungsverträgen",null,null,null,null,null,null,null,"z.B. Zuständige kantonale Stelle(n) und wichtigste Umsetzungspartner / Partner mit Leistungsverträgen",null,null,null,null,null,null,null,"z.B. Zuständige kantonale Stelle(n) und wichtigste Umsetzungspartner / Partner mit Leistungsverträgen",null,null,null,null,null,null,null,"z.B. Zuständige kantonale Stelle(n) und wichtigste Umsetzungspartner / Partner mit Leistungsverträgen",null,null,null,null,null,null,null,"z.B. Zuständige kantonale Stelle(n) und wichtigste Umsetzungspartner / Partner mit Leistungsverträgen",null,null,null,null,null,null,null,"z.B. Zuständige kantonale Stelle(n) und wichtigste Umsetzungspartner / Partner mit Leistungsverträgen",null,null,null,null,null,null,null,"z.B. Zuständige kantonale Stelle(n) und wichtigste Umsetzungspartner / Partner mit Leistungsverträgen",null,null,null,null,null,null,null,"z.B. Zuständige kantonale Stelle(n) und wichtigste Umsetzungspartner / Partner mit Leistungsverträgen",null,null,null,null,null,null,null,"z.B. Zuständige kantonale Stelle(n) und wichtigste Umsetzungspartner / Partner mit Leistungsverträgen",null,null,null,null,null,null,null,"z.B. Zuständige kantonale Stelle(n) und wichtigste Umsetzungspartner / Partner mit Leistungsverträgen",null,null,null,null,null,null,null,"z.B. Zuständige kantonale Stelle(n) und wichtigste Umsetzungspartner / Partner mit Leistungsverträgen",null,null,null,null,null,null,null,"z.B. Zuständige kantonale Stelle(n) und wichtigste Umsetzungspartner / Partner mit Leistungsverträgen",null,null,null,null,null,null,null,"z.B. Zuständige kantonale Stelle(n) und wichtigste Umsetzungspartner / Partner mit Leistungsverträgen",null,null,null,null,null,null,null,"z.B. Zuständige kantonale Stelle(n) und wichtigste Umsetzungspartner / Partner mit Leistungsverträgen",null,null,null,null,null,null,null,"z.B. Zuständige kantonale Stelle(n) und wichtigste Umsetzungspartner / Partner mit Leistungsverträgen",null,null,null,null,null,null,null,"z.B. Zuständige kantonale Stelle(n) und wichtigste Umsetzungspartner / Partner mit Leistungsverträgen",null,null,null,null,null,null,null,"z.B. Zuständige kantonale Stelle(n) und wichtigste Umsetzungspartner / Partner mit Leistungsverträgen",null,null,null,null,null,null,null,"z.B. Zuständige kantonale Stelle(n) und wichtigste Umsetzungspartner / Partner mit Leistungsverträgen",null,null,null,null,null,null,null,"z.B. Zuständige kantonale Stelle(n) und wichtigste Umsetzungspartner / Partner mit Leistungsverträgen",null,null,null,null,null,null,null,"z.B. Zuständige kantonale Stelle(n) und wichtigste Umsetzungspartner / Partner mit Leistungsverträgen",null,null,null,null,null,null,null,"z.B. Zuständige kantonale Stelle(n) und wichtigste Umsetzungspartner / Partner mit Leistungsverträgen",null,null,null,null,null,null,null,"z.B. Zuständige kantonale Stelle(n) und wichtigste Umsetzungspartner / Partner mit Leistungsverträgen",null,null,null,null,null,null,null,"z.B. Zuständige kantonale Stelle(n) und wichtigste Umsetzungspartner / Partner mit Leistungsverträgen",null,null,null,null,null,null,null,"z.B. Zuständige kantonale Stelle(n) und wichtigste Umsetzungspartner / Partner mit Leistungsverträgen",null,null,null,null,null,null,null,"z.B. Zuständige kantonale Stelle(n) und wichtigste Umsetzungspartner / Partner mit Leistungsverträgen",null,null,null,null,null,null,null,"z.B. Zuständige kantonale Stelle(n) und wichtigste Umsetzungspartner / Partner mit Leistungsverträgen",null,null,null,null,null,null,null,"z.B. Zuständige kantonale Stelle(n) und wichtigste Umsetzungspartner / Partner mit Leistungsverträgen",null,null,null,null,null,null,null,"z.B. Zuständige kantonale Stelle(n) und wichtigste Umsetzungspartner / Partner mit Leistungsverträgen",null,null,null,null,null,null,null,"z.B. Zuständige kantonale Stelle(n) und wichtigste Umsetzungspartner / Partner mit Leistungsverträgen",null,null,null,null,null,null,null,"z.B. Zuständige kantonale Stelle(n) und wichtigste Umsetzungspartner / Partner mit Leistungsverträgen",null,null,null,null,null,null,null,"z.B. Zuständige kantonale Stelle(n) und wichtigste Umsetzungspartner / Partner mit Leistungsverträgen",null,null,null,null,null,null,null,"z.B. Zuständige kantonale Stelle(n) und wichtigste Umsetzungspartner / Partner mit Leistungsverträgen",null,null,null,null,null,null,null,"z.B. Zuständige kantonale Stelle(n) und wichtigste Umsetzungspartner / Partner mit Leistungsverträgen",null,null,null,null,null,null,null,"z.B. Zuständige kantonale Stelle(n) und wichtigste Umsetzungspartner / Partner mit Leistungsverträgen",null,null,null,null,null,null,null,"z.B. Zuständige kantonale Stelle(n) und wichtigste Umsetzungspartner / Partner mit Leistungsverträgen",null,null,null,null,null,null,null,"z.B. Zuständige kantonale Stelle(n) und wichtigste Umsetzungspartner / Partner mit Leistungsverträgen",null,null,null,null,null,null,null,"z.B. Zuständige kantonale Stelle(n) und wichtigste Umsetzungspartner / Partner mit Leistungsverträgen",null,null,null,null,null,null,null,"z.B. Zuständige kantonale Stelle(n) und wichtigste Umsetzungspartner / Partner mit Leistungsverträgen",null,null,null,null,null,null,null,"z.B. Zuständige kantonale Stelle(n) und wichtigste Umsetzungspartner / Partner mit Leistungsverträgen",null,null,null,null,null,null,null,"z.B. Zuständige kantonale Stelle(n) und wichtigste Umsetzungspartner / Partner mit Leistungsverträgen",null,null,null,null,null,null,null,"z.B. Zuständige kantonale Stelle(n) und wichtigste Umsetzungspartner / Partner mit Leistungsverträgen",null,null,null,null,null,null,null,"z.B. Zuständige kantonale Stelle(n) und wichtigste Umsetzungspartner / Partner mit Leistungsverträgen",null,null,null,null,null,null,null,"z.B. Zuständige kantonale Stelle(n) und wichtigste Umsetzungspartner / Partner mit Leistungsverträgen",null,null,null,null,null,null,null,"z.B. Zuständige kantonale Stelle(n) und wichtigste Umsetzungspartner / Partner mit Leistungsverträgen",null,null,null,null,null,null,null,"z.B. Zuständige kantonale Stelle(n) und wichtigste Umsetzungspartner / Partner mit Leistungsverträgen",null,null,null,null,null,null,null,"z.B. Zuständige kantonale Stelle(n) und wichtigste Umsetzungspartner / Partner mit Leistungsverträgen",null,null,null,null,null,null,null,"z.B. Zuständige kantonale Stelle(n) und wichtigste Umsetzungspartner / Partner mit Leistungsverträgen",null,null,null,null,null,null,null,"z.B. Zuständige kantonale Stelle(n) und wichtigste Umsetzungspartner / Partner mit Leistungsverträgen",null,null,null,null,null,null,null,"z.B. Zuständige kantonale Stelle(n) und wichtigste Umsetzungspartner / Partner mit Leistungsverträgen",null,null,null,null,null,null,null,"z.B. Zuständige kantonale Stelle(n) und wichtigste Umsetzungspartner / Partner mit Leistungsverträgen",null,null,null,null,null,null,null,"z.B. Zuständige kantonale Stelle(n) und wichtigste Umsetzungspartner / Partner mit Leistungsverträgen",null,null,null,null,null,null,null,"z.B. Zuständige kantonale Stelle(n) und wichtigste Umsetzungspartner / Partner mit Leistungsverträgen",null,null,null,null,null,null,null,"z.B. Zuständige kantonale Stelle(n) und wichtigste Umsetzungspartner / Partner mit Leistungsverträgen",null,null,null,null,null,null,null,"z.B. Zuständige kantonale Stelle(n) und wichtigste Umsetzungspartner / Partner mit Leistungsverträgen",null,null,null,null,null,null,null,"z.B. Zuständige kantonale Stelle(n) und wichtigste Umsetzungspartner / Partner mit Leistungsverträgen",null,null,null,null,null,null,null,"z.B. Zuständige kantonale Stelle(n) und wichtigste Umsetzungspartner / Partner mit Leistungsverträgen",null,null,null,null,null,null,null,"z.B. Zuständige kantonale Stelle(n) und wichtigste Umsetzungspartner / Partner mit Leistungsverträgen",null,null,null,null,null,null,null,"z.B. Zuständige kantonale Stelle(n) und wichtigste Umsetzungspartner / Partner mit Leistungsverträgen",null,null,null,null,null,null,null,"z.B. Zuständige kantonale Stelle(n) und wichtigste Umsetzungspartner / Partner mit Leistungsverträgen",null,null,null,null,null,null,null,"z.B. Zuständige kantonale Stelle(n) und wichtigste Umsetzungspartner / Partner mit Leistungsverträgen",null,null,null,null,null,null,null,"z.B. Zuständige kantonale Stelle(n) und wichtigste Umsetzungspartner / Partner mit Leistungsverträgen",null,null,null,null,null,null,null,"z.B. Zuständige kantonale Stelle(n) und wichtigste Umsetzungspartner / Partner mit Leistungsverträgen",null,null,null,null,null,null,null,"z.B. Zuständige kantonale Stelle(n) und wichtigste Umsetzungspartner / Partner mit Leistungsverträgen",null,null,null,null,null,null,null,"z.B. Zuständige kantonale Stelle(n) und wichtigste Umsetzungspartner / Partner mit Leistungsverträgen",null,null,null,null,null,null,null,"z.B. Zuständige kantonale Stelle(n) und wichtigste Umsetzungspartner / Partner mit Leistungsverträgen",null,null,null,null,null,null,null,"z.B. Zuständige kantonale Stelle(n) und wichtigste Umsetzungspartner / Partner mit Leistungsverträgen",null,null,null,null,null,null,null,"z.B. Zuständige kantonale Stelle(n) und wichtigste Umsetzungspartner / Partner mit Leistungsverträgen",null,null,null,null,null,null,null,"z.B. Zuständige kantonale Stelle(n) und wichtigste Umsetzungspartner / Partner mit Leistungsverträgen",null,null,null,null,null,null,null,"z.B. Zuständige kantonale Stelle(n) und wichtigste Umsetzungspartner / Partner mit Leistungsverträgen",null,null,null,null,null,null,null,"z.B. Zuständige kantonale Stelle(n) und wichtigste Umsetzungspartner / Partner mit Leistungsverträgen",null,null,null,null,null,null,null,"z.B. Zuständige kantonale Stelle(n) und wichtigste Umsetzungspartner / Partner mit Leistungsverträgen",null,null,null,null,null,null,null,"z.B. Zuständige kantonale Stelle(n) und wichtigste Umsetzungspartner / Partner mit Leistungsverträgen",null,null,null,null,null,null,null,"z.B. Zuständige kantonale Stelle(n) und wichtigste Umsetzungspartner / Partner mit Leistungsverträgen",null,null,null,null,null,null,null,"z.B. Zuständige kantonale Stelle(n) und wichtigste Umsetzungspartner / Partner mit Leistungsverträgen",null,null,null,null,null,null,null,"z.B. Zuständige kantonale Stelle(n) und wichtigste Umsetzungspartner / Partner mit Leistungsverträgen",null,null,null,null,null,null,null,"z.B. Zuständige kantonale Stelle(n) und wichtigste Umsetzungspartner / Partner mit Leistungsverträgen",null,null,null,null,null,null,null,"z.B. Zuständige kantonale Stelle(n) und wichtigste Umsetzungspartner / Partner mit Leistungsverträgen",null,null,null,null,null,null,null,"z.B. Zuständige kantonale Stelle(n) und wichtigste Umsetzungspartner / Partner mit Leistungsverträgen",null,null,null,null,null,null,null,"z.B. Zuständige kantonale Stelle(n) und wichtigste Umsetzungspartner / Partner mit Leistungsverträgen",null,null,null,null,null,null,null,"z.B. Zuständige kantonale Stelle(n) und wichtigste Umsetzungspartner / Partner mit Leistungsverträgen",null,null,null,null,null,null,null,"z.B. Zuständige kantonale Stelle(n) und wichtigste Umsetzungspartner / Partner mit Leistungsverträgen",null,null,null,null,null,null,null,"z.B. Zuständige kantonale Stelle(n) und wichtigste Umsetzungspartner / Partner mit Leistungsverträgen",null,null,null,null,null,null,null,"z.B. Zuständige kantonale Stelle(n) und wichtigste Umsetzungspartner / Partner mit Leistungsverträgen",null,null,null,null,null,null,null,"z.B. Zuständige kantonale Stelle(n) und wichtigste Umsetzungspartner / Partner mit Leistungsverträgen",null,null,null,null,null,null,null,"z.B. Zuständige kantonale Stelle(n) und wichtigste Umsetzungspartner / Partner mit Leistungsverträgen",null,null,null,null,null,null,null,"z.B. Zuständige kantonale Stelle(n) und wichtigste Umsetzungspartner / Partner mit Leistungsverträgen",null,null,null,null,null,null,null,"z.B. Zuständige kantonale Stelle(n) und wichtigste Umsetzungspartner / Partner mit Leistungsverträgen",null,null,null,null,null,null,null,"z.B. Zuständige kantonale Stelle(n) und wichtigste Umsetzungspartner / Partner mit Leistungsverträgen",null,null,null,null,null,null,null,"z.B. Zuständige kantonale Stelle(n) und wichtigste Umsetzungspartner / Partner mit Leistungsverträgen",null,null,null,null,null,null,null,"z.B. Zuständige kantonale Stelle(n) und wichtigste Umsetzungspartner / Partner mit Leistungsverträgen",null,null,null,null,null,null,null,"z.B. Zuständige kantonale Stelle(n) und wichtigste Umsetzungspartner / Partner mit Leistungsverträgen",null,null,null,null,null,null,null,"z.B. Zuständige kantonale Stelle(n) und wichtigste Umsetzungspartner / Partner mit Leistungsverträgen",null,null,null,null,null,null,null,"z.B. Zuständige kantonale Stelle(n) und wichtigste Umsetzungspartner / Partner mit Leistungsverträgen",null,null,null,null,null,null,null,"z.B. Zuständige kantonale Stelle(n) und wichtigste Umsetzungspartner / Partner mit Leistungsverträgen",null,null,null,null,null,null,null,"z.B. Zuständige kantonale Stelle(n) und wichtigste Umsetzungspartner / Partner mit Leistungsverträgen",null,null,null,null,null,null,null,"z.B. Zuständige kantonale Stelle(n) und wichtigste Umsetzungspartner / Partner mit Leistungsverträgen",null,null,null,null,null,null,null,"z.B. Zuständige kantonale Stelle(n) und wichtigste Umsetzungspartner / Partner mit Leistungsverträgen",null,null,null,null,null,null,null,"z.B. Zuständige kantonale Stelle(n) und wichtigste Umsetzungspartner / Partner mit Leistungsverträgen",null,null,null,null,null,null,null,"z.B. Zuständige kantonale Stelle(n) und wichtigste Umsetzungspartner / Partner mit Leistungsverträgen",null,null,null,null,null,null,null,"z.B. Zuständige kantonale Stelle(n) und wichtigste Umsetzungspartner / Partner mit Leistungsverträgen",null,null,null,null,null,null,null,"z.B. Zuständige kantonale Stelle(n) und wichtigste Umsetzungspartner / Partner mit Leistungsverträgen",null,null,null,null,null,null,null,"z.B. Zuständige kantonale Stelle(n) und wichtigste Umsetzungspartner / Partner mit Leistungsverträgen",null,null,null,null,null,null,null,"z.B. Zuständige kantonale Stelle(n) und wichtigste Umsetzungspartner / Partner mit Leistungsverträgen",null,null,null,null,null,null,null,"z.B. Zuständige kantonale Stelle(n) und wichtigste Umsetzungspartner / Partner mit Leistungsverträgen",null,null,null,null,null,null,null,"z.B. Zuständige kantonale Stelle(n) und wichtigste Umsetzungspartner / Partner mit Leistungsverträgen",null,null,null,null,null,null,null,"z.B. Zuständige kantonale Stelle(n) und wichtigste Umsetzungspartner / Partner mit Leistungsverträgen",null,null,null,null,null,null,null,"z.B. Zuständige kantonale Stelle(n) und wichtigste Umsetzungspartner / Partner mit Leistungsverträgen",null,null,null,null,null,null,null,"z.B. Zuständige kantonale Stelle(n) und wichtigste Umsetzungspartner / Partner mit Leistungsverträgen",null,null,null,null,null,null,null,"z.B. Zuständige kantonale Stelle(n) und wichtigste Umsetzungspartner / Partner mit Leistungsverträgen",null,null,null,null,null,null,null,"z.B. Zuständige kantonale Stelle(n) und wichtigste Umsetzungspartner / Partner mit Leistungsverträgen",null,null,null,null,null,null,null,"z.B. Zuständige kantonale Stelle(n) und wichtigste Umsetzungspartner / Partner mit Leistungsverträgen",null,null,null,null,null,null,null,"z.B. Zuständige kantonale Stelle(n) und wichtigste Umsetzungspartner / Partner mit Leistungsverträgen",null,null,null,null,null,null,null,"z.B. Zuständige kantonale Stelle(n) und wichtigste Umsetzungspartner / Partner mit Leistungsverträgen",null,null,null,null,null,null,null,"z.B. Zuständige kantonale Stelle(n) und wichtigste Umsetzungspartner / Partner mit Leistungsverträgen",null,null,null,null,null,null,null,"z.B. Zuständige kantonale Stelle(n) und wichtigste Umsetzungspartner / Partner mit Leistungsverträgen",null,null,null,null,null,null,null,"z.B. Zuständige kantonale Stelle(n) und wichtigste Umsetzungspartner / Partner mit Leistungsverträgen",null,null,null,null,null,null,null,"z.B. Zuständige kantonale Stelle(n) und wichtigste Umsetzungspartner / Partner mit Leistungsverträgen",null,null,null,null,null,null,null,"z.B. Zuständige kantonale Stelle(n) und wichtigste Umsetzungspartner / Partner mit Leistungsverträgen",null,null,null,null,null,null,null,"z.B. Zuständige kantonale Stelle(n) und wichtigste Umsetzungspartner / Partner mit Leistungsverträgen",null,null,null,null,null,null,null,"z.B. Zuständige kantonale Stelle(n) und wichtigste Umsetzungspartner / Partner mit Leistungsverträgen",null,null,null,null,null,null,null,"z.B. Zuständige kantonale Stelle(n) und wichtigste Umsetzungspartner / Partner mit Leistungsverträgen",null,null,null,null,null,null,null,"z.B. Zuständige kantonale Stelle(n) und wichtigste Umsetzungspartner / Partner mit Leistungsverträgen",null,null,null,null,null,null,null,"z.B. Zuständige kantonale Stelle(n) und wichtigste Umsetzungspartner / Partner mit Leistungsverträgen",null,null,null,null,null,null,null,"z.B. Zuständige kantonale Stelle(n) und wichtigste Umsetzungspartner / Partner mit Leistungsverträgen",null,null,null,null,null,null,null,"z.B. Zuständige kantonale Stelle(n) und wichtigste Umsetzungspartner / Partner mit Leistungsverträgen",null,null,null,null,null,null,null,"z.B. Zuständige kantonale Stelle(n) und wichtigste Umsetzungspartner / Partner mit Leistungsverträgen",null,null,null,null,null,null,null,"z.B. Zuständige kantonale Stelle(n) und wichtigste Umsetzungspartner / Partner mit Leistungsverträgen",null,null,null,null,null,null,null,"z.B. Zuständige kantonale Stelle(n) und wichtigste Umsetzungspartner / Partner mit Leistungsverträgen",null,null,null,null,null,null,null,"z.B. Zuständige kantonale Stelle(n) und wichtigste Umsetzungspartner / Partner mit Leistungsverträgen",null,null,null,null,null,null,null,"z.B. Zuständige kantonale Stelle(n) und wichtigste Umsetzungspartner / Partner mit Leistungsverträgen",null,null,null,null,null,null,null,"z.B. Zuständige kantonale Stelle(n) und wichtigste Umsetzungspartner / Partner mit Leistungsverträgen",null,null,null,null,null,null,null,"z.B. Zuständige kantonale Stelle(n) und wichtigste Umsetzungspartner / Partner mit Leistungsverträgen",null,null,null,null,null,null,null,"z.B. Zuständige kantonale Stelle(n) und wichtigste Umsetzungspartner / Partner mit Leistungsverträgen",null,null,null,null,null,null,null,"z.B. Zuständige kantonale Stelle(n) und wichtigste Umsetzungspartner / Partner mit Leistungsverträgen",null,null,null,null,null,null,null,"z.B. Zuständige kantonale Stelle(n) und wichtigste Umsetzungspartner / Partner mit Leistungsverträgen",null,null,null,null,null,null,null,"z.B. Zuständige kantonale Stelle(n) und wichtigste Umsetzungspartner / Partner mit Leistungsverträgen",null,null,null,null,null,null,null,"z.B. Zuständige kantonale Stelle(n) und wichtigste Umsetzungspartner / Partner mit Leistungsverträgen",null,null,null,null,null,null,null,"z.B. Zuständige kantonale Stelle(n) und wichtigste Umsetzungspartner / Partner mit Leistungsverträgen",null,null,null,null,null,null,null,"z.B. Zuständige kantonale Stelle(n) und wichtigste Umsetzungspartner / Partner mit Leistungsverträgen",null,null,null,null,null,null,null,"z.B. Zuständige kantonale Stelle(n) und wichtigste Umsetzungspartner / Partner mit Leistungsverträgen",null,null,null,null,null,null,null,"z.B. Zuständige kantonale Stelle(n) und wichtigste Umsetzungspartner / Partner mit Leistungsverträgen",null,null,null,null,null,null,null,"z.B. Zuständige kantonale Stelle(n) und wichtigste Umsetzungspartner / Partner mit Leistungsverträgen",null,null,null,null,null,null,null,"z.B. Zuständige kantonale Stelle(n) und wichtigste Umsetzungspartner / Partner mit Leistungsverträgen",null,null,null,null,null,null,null,"z.B. Zuständige kantonale Stelle(n) und wichtigste Umsetzungspartner / Partner mit Leistungsverträgen",null,null,null,null,null,null,null,"z.B. Zuständige kantonale Stelle(n) und wichtigste Umsetzungspartner / Partner mit Leistungsverträgen",null,null,null,null,null,null,null,"z.B. Zuständige kantonale Stelle(n) und wichtigste Umsetzungspartner / Partner mit Leistungsverträgen",null,null,null,null,null,null,null,"z.B. Zuständige kantonale Stelle(n) und wichtigste Umsetzungspartner / Partner mit Leistungsverträgen",null,null,null,null,null,null,null,"z.B. Zuständige kantonale Stelle(n) und wichtigste Umsetzungspartner / Partner mit Leistungsverträgen",null,null,null,null,null,null,null,"z.B. Zuständige kantonale Stelle(n) und wichtigste Umsetzungspartner / Partner mit Leistungsverträgen",null,null,null,null,null,null,null,"z.B. Zuständige kantonale Stelle(n) und wichtigste Umsetzungspartner / Partner mit Leistungsverträgen",null,null,null,null,null,null,null,"z.B. Zuständige kantonale Stelle(n) und wichtigste Umsetzungspartner / Partner mit Leistungsverträgen",null,null,null,null,null,null,null,"z.B. Zuständige kantonale Stelle(n) und wichtigste Umsetzungspartner / Partner mit Leistungsverträgen",null,null,null,null,null,null,null,"z.B. Zuständige kantonale Stelle(n) und wichtigste Umsetzungspartner / Partner mit Leistungsverträgen",null,null,null,null,null,null,null,"z.B. Zuständige kantonale Stelle(n) und wichtigste Umsetzungspartner / Partner mit Leistungsverträgen",null,null,null,null,null,null,null,"z.B. Zuständige kantonale Stelle(n) und wichtigste Umsetzungspartner / Partner mit Leistungsverträgen",null,null,null,null,null,null,null,"z.B. Zuständige kantonale Stelle(n) und wichtigste Umsetzungspartner / Partner mit Leistungsverträgen",null,null,null,null,null,null,null,"z.B. Zuständige kantonale Stelle(n) und wichtigste Umsetzungspartner / Partner mit Leistungsverträgen",null,null,null,null,null,null,null,"z.B. Zuständige kantonale Stelle(n) und wichtigste Umsetzungspartner / Partner mit Leistungsverträgen",null,null,null,null,null,null,null,"z.B. Zuständige kantonale Stelle(n) und wichtigste Umsetzungspartner / Partner mit Leistungsverträgen",null,null,null,null,null,null,null,"z.B. Zuständige kantonale Stelle(n) und wichtigste Umsetzungspartner / Partner mit Leistungsverträgen",null,null,null,null,null,null,null,"z.B. Zuständige kantonale Stelle(n) und wichtigste Umsetzungspartner / Partner mit Leistungsverträgen",null,null,null,null,null,null,null,"z.B. Zuständige kantonale Stelle(n) und wichtigste Umsetzungspartner / Partner mit Leistungsverträgen",null,null,null,null,null,null,null,"z.B. Zuständige kantonale Stelle(n) und wichtigste Umsetzungspartner / Partner mit Leistungsverträgen",null,null,null,null,null,null,null,"z.B. Zuständige kantonale Stelle(n) und wichtigste Umsetzungspartner / Partner mit Leistungsverträgen",null,null,null,null,null,null,null,"z.B. Zuständige kantonale Stelle(n) und wichtigste Umsetzungspartner / Partner mit Leistungsverträgen",null,null,null,null,null,null,null,"z.B. Zuständige kantonale Stelle(n) und wichtigste Umsetzungspartner / Partner mit Leistungsverträgen",null,null,null,null,null,null,null,"z.B. Zuständige kantonale Stelle(n) und wichtigste Umsetzungspartner / Partner mit Leistungsverträgen",null,null,null,null,null,null,null,"z.B. Zuständige kantonale Stelle(n) und wichtigste Umsetzungspartner / Partner mit Leistungsverträgen",null,null,null,null,null,null,null,"z.B. Zuständige kantonale Stelle(n) und wichtigste Umsetzungspartner / Partner mit Leistungsverträgen",null,null,null,null,null,null,null,"z.B. Zuständige kantonale Stelle(n) und wichtigste Umsetzungspartner / Partner mit Leistungsverträgen",null,null,null,null,null,null,null,"z.B. Zuständige kantonale Stelle(n) und wichtigste Umsetzungspartner / Partner mit Leistungsverträgen",null,null,null,null,null,null,null,"z.B. Zuständige kantonale Stelle(n) und wichtigste Umsetzungspartner / Partner mit Leistungsverträgen",null,null,null,null,null,null,null,"z.B. Zuständige kantonale Stelle(n) und wichtigste Umsetzungspartner / Partner mit Leistungsverträgen",null,null,null,null,null,null,null,"z.B. Zuständige kantonale Stelle(n) und wichtigste Umsetzungspartner / Partner mit Leistungsverträgen",null,null,null,null,null,null,null,"z.B. Zuständige kantonale Stelle(n) und wichtigste Umsetzungspartner / Partner mit Leistungsverträgen",null,null,null,null,null,null,null,"z.B. Zuständige kantonale Stelle(n) und wichtigste Umsetzungspartner / Partner mit Leistungsverträgen",null,null,null,null,null,null,null,"z.B. Zuständige kantonale Stelle(n) und wichtigste Umsetzungspartner / Partner mit Leistungsverträgen",null,null,null,null,null,null,null,"z.B. Zuständige kantonale Stelle(n) und wichtigste Umsetzungspartner / Partner mit Leistungsverträgen",null,null,null,null,null,null,null,"z.B. Zuständige kantonale Stelle(n) und wichtigste Umsetzungspartner / Partner mit Leistungsverträgen",null,null,null,null,null,null,null,"z.B. Zuständige kantonale Stelle(n) und wichtigste Umsetzungspartner / Partner mit Leistungsverträgen",null,null,null,null,null,null,null,"z.B. Zuständige kantonale Stelle(n) und wichtigste Umsetzungspartner / Partner mit Leistungsverträgen",null,null,null,null,null,null,null,"z.B. Zuständige kantonale Stelle(n) und wichtigste Umsetzungspartner / Partner mit Leistungsverträgen",null,null,null,null,null,null,null,"z.B. Zuständige kantonale Stelle(n) und wichtigste Umsetzungspartner / Partner mit Leistungsverträgen",null,null,null,null,null,null,null,"z.B. Zuständige kantonale Stelle(n) und wichtigste Umsetzungspartner / Partner mit Leistungsverträgen",null,null,null,null,null,null,null,"z.B. Zuständige kantonale Stelle(n) und wichtigste Umsetzungspartner / Partner mit Leistungsverträgen",null,null,null,null,null,null,null,"z.B. Zuständige kantonale Stelle(n) und wichtigste Umsetzungspartner / Partner mit Leistungsverträgen",null,null,null,null,null,null,null,"z.B. Zuständige kantonale Stelle(n) und wichtigste Umsetzungspartner / Partner mit Leistungsverträgen",null,null,null,null,null,null,null,"z.B. Zuständige kantonale Stelle(n) und wichtigste Umsetzungspartner / Partner mit Leistungsverträgen",null,null,null,null,null,null,null,"z.B. Zuständige kantonale Stelle(n) und wichtigste Umsetzungspartner / Partner mit Leistungsverträgen",null,null,null,null,null,null,null,"z.B. Zuständige kantonale Stelle(n) und wichtigste Umsetzungspartner / Partner mit Leistungsverträgen",null,null,null,null,null,null,null,"z.B. Zuständige kantonale Stelle(n) und wichtigste Umsetzungspartner / Partner mit Leistungsverträgen",null,null,null,null,null,null,null,"z.B. Zuständige kantonale Stelle(n) und wichtigste Umsetzungspartner / Partner mit Leistungsverträgen",null,null,null,null,null,null,null,"z.B. Zuständige kantonale Stelle(n) und wichtigste Umsetzungspartner / Partner mit Leistungsverträgen",null,null,null,null,null,null,null,"z.B. Zuständige kantonale Stelle(n) und wichtigste Umsetzungspartner / Partner mit Leistungsverträgen",null,null,null,null,null,null,null,"z.B. Zuständige kantonale Stelle(n) und wichtigste Umsetzungspartner / Partner mit Leistungsverträgen",null,null,null,null,null,null,null,"z.B. Zuständige kantonale Stelle(n) und wichtigste Umsetzungspartner / Partner mit Leistungsverträgen",null,null,null,null,null,null,null,"z.B. Zuständige kantonale Stelle(n) und wichtigste Umsetzungspartner / Partner mit Leistungsverträgen",null,null,null,null,null,null,null,"z.B. Zuständige kantonale Stelle(n) und wichtigste Umsetzungspartner / Partner mit Leistungsverträgen",null,null,null,null,null,null,null,"z.B. Zuständige kantonale Stelle(n) und wichtigste Umsetzungspartner / Partner mit Leistungsverträgen",null,null,null,null,null,null,null,"z.B. Zuständige kantonale Stelle(n) und wichtigste Umsetzungspartner / Partner mit Leistungsverträgen",null,null,null,null,null,null,null,"z.B. Zuständige kantonale Stelle(n) und wichtigste Umsetzungspartner / Partner mit Leistungsverträgen",null,null,null,null,null,null,null,"z.B. Zuständige kantonale Stelle(n) und wichtigste Umsetzungspartner / Partner mit Leistungsverträgen",null,null,null,null,null,null,null,"z.B. Zuständige kantonale Stelle(n) und wichtigste Umsetzungspartner / Partner mit Leistungsverträgen",null,null,null,null,null,null,null,"z.B. Zuständige kantonale Stelle(n) und wichtigste Umsetzungspartner / Partner mit Leistungsverträgen",null,null,null,null,null,null,null,"z.B. Zuständige kantonale Stelle(n) und wichtigste Umsetzungspartner / Partner mit Leistungsverträgen",null,null,null,null,null,null,null,"z.B. Zuständige kantonale Stelle(n) und wichtigste Umsetzungspartner / Partner mit Leistungsverträgen",null,null,null,null,null,null,null,"z.B. Zuständige kantonale Stelle(n) und wichtigste Umsetzungspartner / Partner mit Leistungsverträgen",null,null,null,null,null,null,null,"z.B. Zuständige kantonale Stelle(n) und wichtigste Umsetzungspartner / Partner mit Leistungsverträgen",null,null,null,null,null,null,null,"z.B. Zuständige kantonale Stelle(n) und wichtigste Umsetzungspartner / Partner mit Leistungsverträgen",null,null,null,null,null,null,null,"z.B. Zuständige kantonale Stelle(n) und wichtigste Umsetzungspartner / Partner mit Leistungsverträgen",null,null,null,null,null,null,null,"z.B. Zuständige kantonale Stelle(n) und wichtigste Umsetzungspartner / Partner mit Leistungsverträgen",null,null,null,null,null,null,null,"z.B. Zuständige kantonale Stelle(n) und wichtigste Umsetzungspartner / Partner mit Leistungsverträgen",null,null,null,null,null,null,null,"z.B. Zuständige kantonale Stelle(n) und wichtigste Umsetzungspartner / Partner mit Leistungsverträgen",null,null,null,null,null,null,null,"z.B. Zuständige kantonale Stelle(n) und wichtigste Umsetzungspartner / Partner mit Leistungsverträgen",null,null,null,null,null,null,null,"z.B. Zuständige kantonale Stelle(n) und wichtigste Umsetzungspartner / Partner mit Leistungsverträgen",null,null,null,null,null,null,null,"z.B. Zuständige kantonale Stelle(n) und wichtigste Umsetzungspartner / Partner mit Leistungsverträgen",null,null,null,null,null,null,null,"z.B. Zuständige kantonale Stelle(n) und wichtigste Umsetzungspartner / Partner mit Leistungsverträgen",null,null,null,null,null,null,null,"z.B. Zuständige kantonale Stelle(n) und wichtigste Umsetzungspartner / Partner mit Leistungsverträgen",null,null,null,null,null,null,null,"z.B. Zuständige kantonale Stelle(n) und wichtigste Umsetzungspartner / Partner mit Leistungsverträgen",null,null,null,null,null,null,null,"z.B. Zuständige kantonale Stelle(n) und wichtigste Umsetzungspartner / Partner mit Leistungsverträgen",null,null,null,null,null,null,null,"z.B. Zuständige kantonale Stelle(n) und wichtigste Umsetzungspartner / Partner mit Leistungsverträgen",null,null,null,null,null,null,null,"z.B. Zuständige kantonale Stelle(n) und wichtigste Umsetzungspartner / Partner mit Leistungsverträgen",null,null,null,null,null,null,null,"z.B. Zuständige kantonale Stelle(n) und wichtigste Umsetzungspartner / Partner mit Leistungsverträgen",null,null,null,null,null,null,null,"z.B. Zuständige kantonale Stelle(n) und wichtigste Umsetzungspartner / Partner mit Leistungsverträgen",null,null,null,null,null,null,null,"z.B. Zuständige kantonale Stelle(n) und wichtigste Umsetzungspartner / Partner mit Leistungsverträgen",null,null,null,null,null,null,null,"z.B. Zuständige kantonale Stelle(n) und wichtigste Umsetzungspartner / Partner mit Leistungsverträgen",null,null,null,null,null,null,null,"z.B. Zuständige kantonale Stelle(n) und wichtigste Umsetzungspartner / Partner mit Leistungsverträgen",null,null,null,null,null,null,null,"z.B. Zuständige kantonale Stelle(n) und wichtigste Umsetzungspartner / Partner mit Leistungsverträgen",null,null,null,null,null,null,null,"z.B. Zuständige kantonale Stelle(n) und wichtigste Umsetzungspartner / Partner mit Leistungsverträgen",null,null,null,null,null,null,null,"z.B. Zuständige kantonale Stelle(n) und wichtigste Umsetzungspartner / Partner mit Leistungsverträgen",null,null,null,null,null,null,null,"z.B. Zuständige kantonale Stelle(n) und wichtigste Umsetzungspartner / Partner mit Leistungsverträgen",null,null,null,null,null,null,null,"z.B. Zuständige kantonale Stelle(n) und wichtigste Umsetzungspartner / Partner mit Leistungsverträgen",null,null,null,null,null,null,null,"z.B. Zuständige kantonale Stelle(n) und wichtigste Umsetzungspartner / Partner mit Leistungsverträgen",null,null,null,null,null,null,null,"z.B. Zuständige kantonale Stelle(n) und wichtigste Umsetzungspartner / Partner mit Leistungsverträgen",null,null,null,null,null,null,null,"z.B. Zuständige kantonale Stelle(n) und wichtigste Umsetzungspartner / Partner mit Leistungsverträgen",null,null,null,null,null,null,null,"z.B. Zuständige kantonale Stelle(n) und wichtigste Umsetzungspartner / Partner mit Leistungsverträgen",null,null,null,null,null,null,null,"z.B. Zuständige kantonale Stelle(n) und wichtigste Umsetzungspartner / Partner mit Leistungsverträgen",null,null,null,null,null,null,null,"z.B. Zuständige kantonale Stelle(n) und wichtigste Umsetzungspartner / Partner mit Leistungsverträgen",null,null,null,null,null,null,null,"z.B. Zuständige kantonale Stelle(n) und wichtigste Umsetzungspartner / Partner mit Leistungsverträgen",null,null,null,null,null,null,null,"z.B. Zuständige kantonale Stelle(n) und wichtigste Umsetzungspartner / Partner mit Leistungsverträgen",null,null,null,null,null,null,null,"z.B. Zuständige kantonale Stelle(n) und wichtigste Umsetzungspartner / Partner mit Leistungsverträgen",null,null,null,null,null,null,null,"z.B. Zuständige kantonale Stelle(n) und wichtigste Umsetzungspartner / Partner mit Leistungsverträgen",null,null,null,null,null,null,null,"z.B. Zuständige kantonale Stelle(n) und wichtigste Umsetzungspartner / Partner mit Leistungsverträgen",null,null,null,null,null,null,null,"z.B. Zuständige kantonale Stelle(n) und wichtigste Umsetzungspartner / Partner mit Leistungsverträgen",null,null,null,null,null,null,null,"z.B. Zuständige kantonale Stelle(n) und wichtigste Umsetzungspartner / Partner mit Leistungsverträgen",null,null,null,null,null,null,null,"z.B. Zuständige kantonale Stelle(n) und wichtigste Umsetzungspartner / Partner mit Leistungsverträgen",null,null,null,null,null,null,null,"z.B. Zuständige kantonale Stelle(n) und wichtigste Umsetzungspartner / Partner mit Leistungsverträgen",null,null,null,null,null,null,null,"z.B. Zuständige kantonale Stelle(n) und wichtigste Umsetzungspartner / Partner mit Leistungsverträgen",null,null,null,null,null,null,null,"z.B. Zuständige kantonale Stelle(n) und wichtigste Umsetzungspartner / Partner mit Leistungsverträgen",null,null,null,null,null,null,null,"z.B. Zuständige kantonale Stelle(n) und wichtigste Umsetzungspartner / Partner mit Leistungsverträgen",null,null,null,null,null,null,null,"z.B. Zuständige kantonale Stelle(n) und wichtigste Umsetzungspartner / Partner mit Leistungsverträgen",null,null,null,null,null,null,null,"z.B. Zuständige kantonale Stelle(n) und wichtigste Umsetzungspartner / Partner mit Leistungsverträgen",null,null,null,null,null,null,null,"z.B. Zuständige kantonale Stelle(n) und wichtigste Umsetzungspartner / Partner mit Leistungsverträgen",null,null,null,null,null,null,null,"z.B. Zuständige kantonale Stelle(n) und wichtigste Umsetzungspartner / Partner mit Leistungsverträgen",null,null,null,null,null,null,null,"z.B. Zuständige kantonale Stelle(n) und wichtigste Umsetzungspartner / Partner mit Leistungsverträgen",null,null,null,null,null,null,null,"z.B. Zuständige kantonale Stelle(n) und wichtigste Umsetzungspartner / Partner mit Leistungsverträgen",null,null,null,null,null,null,null,"z.B. Zuständige kantonale Stelle(n) und wichtigste Umsetzungspartner / Partner mit Leistungsverträgen",null,null,null,null,null,null,null,"z.B. Zuständige kantonale Stelle(n) und wichtigste Umsetzungspartner / Partner mit Leistungsverträgen",null,null,null,null,null,null,null,"z.B. Zuständige kantonale Stelle(n) und wichtigste Umsetzungspartner / Partner mit Leistungsverträgen",null,null,null,null,null,null,null,"z.B. Zuständige kantonale Stelle(n) und wichtigste Umsetzungspartner / Partner mit Leistungsverträgen",null,null,null,null,null,null,null,"z.B. Zuständige kantonale Stelle(n) und wichtigste Umsetzungspartner / Partner mit Leistungsverträgen",null,null,null,null,null,null,null,"z.B. Zuständige kantonale Stelle(n) und wichtigste Umsetzungspartner / Partner mit Leistungsverträgen",null,null,null,null,null,null,null,"z.B. Zuständige kantonale Stelle(n) und wichtigste Umsetzungspartner / Partner mit Leistungsverträgen",null,null,null,null,null,null,null,"z.B. Zuständige kantonale Stelle(n) und wichtigste Umsetzungspartner / Partner mit Leistungsverträgen",null,null,null,null,null,null,null,"z.B. Zuständige kantonale Stelle(n) und wichtigste Umsetzungspartner / Partner mit Leistungsverträgen",null,null,null,null,null,null,null,"z.B. Zuständige kantonale Stelle(n) und wichtigste Umsetzungspartner / Partner mit Leistungsverträgen",null,null,null,null,null,null,null,"z.B. Zuständige kantonale Stelle(n) und wichtigste Umsetzungspartner / Partner mit Leistungsverträgen",null,null,null,null,null,null,null,"z.B. Zuständige kantonale Stelle(n) und wichtigste Umsetzungspartner / Partner mit Leistungsverträgen",null,null,null,null,null,null,null,"z.B. Zuständige kantonale Stelle(n) und wichtigste Umsetzungspartner / Partner mit Leistungsverträgen",null,null,null,null,null,null,null,"z.B. Zuständige kantonale Stelle(n) und wichtigste Umsetzungspartner / Partner mit Leistungsverträgen",null,null,null,null,null,null,null,"z.B. Zuständige kantonale Stelle(n) und wichtigste Umsetzungspartner / Partner mit Leistungsverträgen",null,null,null,null,null,null,null,"z.B. Zuständige kantonale Stelle(n) und wichtigste Umsetzungspartner / Partner mit Leistungsverträgen",null,null,null,null,null,null,null,"z.B. Zuständige kantonale Stelle(n) und wichtigste Umsetzungspartner / Partner mit Leistungsverträgen",null,null,null,null,null,null,null,"z.B. Zuständige kantonale Stelle(n) und wichtigste Umsetzungspartner / Partner mit Leistungsverträgen",null,null,null,null,null,null,null,"z.B. Zuständige kantonale Stelle(n) und wichtigste Umsetzungspartner / Partner mit Leistungsverträgen",null,null,null,null,null,null,null,"z.B. Zuständige kantonale Stelle(n) und wichtigste Umsetzungspartner / Partner mit Leistungsverträgen",null,null,null,null,null,null,null,"z.B. Zuständige kantonale Stelle(n) und wichtigste Umsetzungspartner / Partner mit Leistungsverträgen",null,null,null,null,null,null,null,"z.B. Zuständige kantonale Stelle(n) und wichtigste Umsetzungspartner / Partner mit Leistungsverträgen",null,null,null,null,null,null,null,"z.B. Zuständige kantonale Stelle(n) und wichtigste Umsetzungspartner / Partner mit Leistungsverträgen",null,null,null,null,null,null,null,"z.B. Zuständige kantonale Stelle(n) und wichtigste Umsetzungspartner / Partner mit Leistungsverträgen",null,null,null,null,null,null,null,"z.B. Zuständige kantonale Stelle(n) und wichtigste Umsetzungspartner / Partner mit Leistungsverträgen",null,null,null,null,null,null,null,"z.B. Zuständige kantonale Stelle(n) und wichtigste Umsetzungspartner / Partner mit Leistungsverträgen",null,null,null,null,null,null,null,"z.B. Zuständige kantonale Stelle(n) und wichtigste Umsetzungspartner / Partner mit Leistungsverträgen",null,null,null,null,null,null,null,"z.B. Zuständige kantonale Stelle(n) und wichtigste Umsetzungspartner / Partner mit Leistungsverträgen",null,null,null,null,null,null,null,"z.B. Zuständige kantonale Stelle(n) und wichtigste Umsetzungspartner / Partner mit Leistungsverträgen",null,null,null,null,null,null,null,"z.B. Zuständige kantonale Stelle(n) und wichtigste Umsetzungspartner / Partner mit Leistungsverträgen",null,null,null,null,null,null,null,"z.B. Zuständige kantonale Stelle(n) und wichtigste Umsetzungspartner / Partner mit Leistungsverträgen",null,null,null,null,null,null,null,"z.B. Zuständige kantonale Stelle(n) und wichtigste Umsetzungspartner / Partner mit Leistungsverträgen",null,null,null,null,null,null,null,"z.B. Zuständige kantonale Stelle(n) und wichtigste Umsetzungspartner / Partner mit Leistungsverträgen",null,null,null,null,null,null,null,"z.B. Zuständige kantonale Stelle(n) und wichtigste Umsetzungspartner / Partner mit Leistungsverträgen",null,null,null,null,null,null,null,"z.B. Zuständige kantonale Stelle(n) und wichtigste Umsetzungspartner / Partner mit Leistungsverträgen",null,null,null,null,null,null,null,"z.B. Zuständige kantonale Stelle(n) und wichtigste Umsetzungspartner / Partner mit Leistungsverträgen",null,null,null,null,null,null,null,"z.B. Zuständige kantonale Stelle(n) und wichtigste Umsetzungspartner / Partner mit Leistungsverträgen",null,null,null,null,null,null,null,"z.B. Zuständige kantonale Stelle(n) und wichtigste Umsetzungspartner / Partner mit Leistungsverträgen",null,null,null,null,null,null,null,"z.B. Zuständige kantonale Stelle(n) und wichtigste Umsetzungspartner / Partner mit Leistungsverträgen",null,null,null,null,null,null,null,"z.B. Zuständige kantonale Stelle(n) und wichtigste Umsetzungspartner / Partner mit Leistungsverträgen",null,null,null,null,null,null,null,"z.B. Zuständige kantonale Stelle(n) und wichtigste Umsetzungspartner / Partner mit Leistungsverträgen",null,null,null,null,null,null,null,"z.B. Zuständige kantonale Stelle(n) und wichtigste Umsetzungspartner / Partner mit Leistungsverträgen",null,null,null,null,null,null,null,"z.B. Zuständige kantonale Stelle(n) und wichtigste Umsetzungspartner / Partner mit Leistungsverträgen",null,null,null,null,null,null,null,"z.B. Zuständige kantonale Stelle(n) und wichtigste Umsetzungspartner / Partner mit Leistungsverträgen",null,null,null,null,null,null,null,"z.B. Zuständige kantonale Stelle(n) und wichtigste Umsetzungspartner / Partner mit Leistungsverträgen",null,null,null,null,null,null,null,"z.B. Zuständige kantonale Stelle(n) und wichtigste Umsetzungspartner / Partner mit Leistungsverträgen",null,null,null,null,null,null,null,"z.B. Zuständige kantonale Stelle(n) und wichtigste Umsetzungspartner / Partner mit Leistungsverträgen",null,null,null,null,null,null,null,"z.B. Zuständige kantonale Stelle(n) und wichtigste Umsetzungspartner / Partner mit Leistungsverträgen",null,null,null,null,null,null,null,"z.B. Zuständige kantonale Stelle(n) und wichtigste Umsetzungspartner / Partner mit Leistungsverträgen",null,null,null,null,null,null,null,"z.B. Zuständige kantonale Stelle(n) und wichtigste Umsetzungspartner / Partner mit Leistungsverträgen",null,null,null,null,null,null,null,"z.B. Zuständige kantonale Stelle(n) und wichtigste Umsetzungspartner / Partner mit Leistungsverträgen",null,null,null,null,null,null,null,"z.B. Zuständige kantonale Stelle(n) und wichtigste Umsetzungspartner / Partner mit Leistungsverträgen",null,null,null,null,null,null,null,"z.B. Zuständige kantonale Stelle(n) und wichtigste Umsetzungspartner / Partner mit Leistungsverträgen",null,null,null,null,null,null,null,"z.B. Zuständige kantonale Stelle(n) und wichtigste Umsetzungspartner / Partner mit Leistungsverträgen",null,null,null,null,null,null,null,"z.B. Zuständige kantonale Stelle(n) und wichtigste Umsetzungspartner / Partner mit Leistungsverträgen",null,null,null,null,null,null,null,"z.B. Zuständige kantonale Stelle(n) und wichtigste Umsetzungspartner / Partner mit Leistungsverträgen",null,null,null,null,null,null,null,"z.B. Zuständige kantonale Stelle(n) und wichtigste Umsetzungspartner / Partner mit Leistungsverträgen",null,null,null,null,null,null,null,"z.B. Zuständige kantonale Stelle(n) und wichtigste Umsetzungspartner / Partner mit Leistungsverträgen",null,null,null,null,null,null,null,"z.B. Zuständige kantonale Stelle(n) und wichtigste Umsetzungspartner / Partner mit Leistungsverträgen",null,null,null,null,null,null,null,"z.B. Zuständige kantonale Stelle(n) und wichtigste Umsetzungspartner / Partner mit Leistungsverträgen",null,null,null,null,null,null,null,"z.B. Zuständige kantonale Stelle(n) und wichtigste Umsetzungspartner / Partner mit Leistungsverträgen",null,null,null,null,null,null,null,"z.B. Zuständige kantonale Stelle(n) und wichtigste Umsetzungspartner / Partner mit Leistungsverträgen",null,null,null,null,null,null,null,"z.B. Zuständige kantonale Stelle(n) und wichtigste Umsetzungspartner / Partner mit Leistungsverträgen",null,null,null,null,null,null,null,"z.B. Zuständige kantonale Stelle(n) und wichtigste Umsetzungspartner / Partner mit Leistungsverträgen",null,null,null,null,null,null,null,"z.B. Zuständige kantonale Stelle(n) und wichtigste Umsetzungspartner / Partner mit Leistungsverträgen",null,null,null,null,null,null,null,"z.B. Zuständige kantonale Stelle(n) und wichtigste Umsetzungspartner / Partner mit Leistungsverträgen",null,null,null,null,null,null,null,"z.B. Zuständige kantonale Stelle(n) und wichtigste Umsetzungspartner / Partner mit Leistungsverträgen",null,null,null,null,null,null,null,"z.B. Zuständige kantonale Stelle(n) und wichtigste Umsetzungspartner / Partner mit Leistungsverträgen",null,null,null,null,null,null,null,"z.B. Zuständige kantonale Stelle(n) und wichtigste Umsetzungspartner / Partner mit Leistungsverträgen",null,null,null,null,null,null,null,"z.B. Zuständige kantonale Stelle(n) und wichtigste Umsetzungspartner / Partner mit Leistungsverträgen",null,null,null,null,null,null,null,"z.B. Zuständige kantonale Stelle(n) und wichtigste Umsetzungspartner / Partner mit Leistungsverträgen",null,null,null,null,null,null,null,"z.B. Zuständige kantonale Stelle(n) und wichtigste Umsetzungspartner / Partner mit Leistungsverträgen",null,null,null,null,null,null,null,"z.B. Zuständige kantonale Stelle(n) und wichtigste Umsetzungspartner / Partner mit Leistungsverträgen",null,null,null,null,null,null,null,"z.B. Zuständige kantonale Stelle(n) und wichtigste Umsetzungspartner / Partner mit Leistungsverträgen",null,null,null,null,null,null,null,"z.B. Zuständige kantonale Stelle(n) und wichtigste Umsetzungspartner / Partner mit Leistungsverträgen",null,null,null,null,null,null,null,"z.B. Zuständige kantonale Stelle(n) und wichtigste Umsetzungspartner / Partner mit Leistungsverträgen",null,null,null,null,null,null,null,"z.B. Zuständige kantonale Stelle(n) und wichtigste Umsetzungspartner / Partner mit Leistungsverträgen",null,null,null,null,null,null,null,"z.B. Zuständige kantonale Stelle(n) und wichtigste Umsetzungspartner / Partner mit Leistungsverträgen",null,null,null,null,null,null,null,"z.B. Zuständige kantonale Stelle(n) und wichtigste Umsetzungspartner / Partner mit Leistungsverträgen",null,null,null,null,null,null,null,"z.B. Zuständige kantonale Stelle(n) und wichtigste Umsetzungspartner / Partner mit Leistungsverträgen",null,null,null,null,null,null,null,"z.B. Zuständige kantonale Stelle(n) und wichtigste Umsetzungspartner / Partner mit Leistungsverträgen",null,null,null,null,null,null,null,"z.B. Zuständige kantonale Stelle(n) und wichtigste Umsetzungspartner / Partner mit Leistungsverträgen",null,null,null,null,null,null,null,"z.B. Zuständige kantonale Stelle(n) und wichtigste Umsetzungspartner / Partner mit Leistungsverträgen",null,null,null,null,null,null,null,"z.B. Zuständige kantonale Stelle(n) und wichtigste Umsetzungspartner / Partner mit Leistungsverträgen",null,null,null,null,null,null,null,"z.B. Zuständige kantonale Stelle(n) und wichtigste Umsetzungspartner / Partner mit Leistungsverträgen",null,null,null,null,null,null,null,"z.B. Zuständige kantonale Stelle(n) und wichtigste Umsetzungspartner / Partner mit Leistungsverträgen",null,null,null,null,null,null,null,"z.B. Zuständige kantonale Stelle(n) und wichtigste Umsetzungspartner / Partner mit Leistungsverträgen",null,null,null,null,null,null,null,"z.B. Zuständige kantonale Stelle(n) und wichtigste Umsetzungspartner / Partner mit Leistungsverträgen",null,null,null,null,null,null,null,"z.B. Zuständige kantonale Stelle(n) und wichtigste Umsetzungspartner / Partner mit Leistungsverträgen",null,null,null,null,null,null,null,"z.B. Zuständige kantonale Stelle(n) und wichtigste Umsetzungspartner / Partner mit Leistungsverträgen",null,null,null,null,null,null,null,"z.B. Zuständige kantonale Stelle(n) und wichtigste Umsetzungspartner / Partner mit Leistungsverträgen",null,null,null,null,null,null,null,"z.B. Zuständige kantonale Stelle(n) und wichtigste Umsetzungspartner / Partner mit Leistungsverträgen",null,null,null,null,null,null,null,"z.B. Zuständige kantonale Stelle(n) und wichtigste Umsetzungspartner / Partner mit Leistungsverträgen",null,null,null,null,null,null,null,"z.B. Zuständige kantonale Stelle(n) und wichtigste Umsetzungspartner / Partner mit Leistungsverträgen",null,null,null,null,null,null,null,"z.B. Zuständige kantonale Stelle(n) und wichtigste Umsetzungspartner / Partner mit Leistungsverträgen",null,null,null,null,null,null,null,"z.B. Zuständige kantonale Stelle(n) und wichtigste Umsetzungspartner / Partner mit Leistungsverträgen",null,null,null,null,null,null,null,"z.B. Zuständige kantonale Stelle(n) und wichtigste Umsetzungspartner / Partner mit Leistungsverträgen",null,null,null,null,null,null,null,"z.B. Zuständige kantonale Stelle(n) und wichtigste Umsetzungspartner / Partner mit Leistungsverträgen",null,null,null,null,null,null,null,"z.B. Zuständige kantonale Stelle(n) und wichtigste Umsetzungspartner / Partner mit Leistungsverträgen",null,null,null,null,null,null,null,"z.B. Zuständige kantonale Stelle(n) und wichtigste Umsetzungspartner / Partner mit Leistungsverträgen",null,null,null,null,null,null,null,"z.B. Zuständige kantonale Stelle(n) und wichtigste Umsetzungspartner / Partner mit Leistungsverträgen",null,null,null,null,null,null,null,"z.B. Zuständige kantonale Stelle(n) und wichtigste Umsetzungspartner / Partner mit Leistungsverträgen",null,null,null,null,null,null,null,"z.B. Zuständige kantonale Stelle(n) und wichtigste Umsetzungspartner / Partner mit Leistungsverträgen",null,null,null,null,null,null,null,"z.B. Zuständige kantonale Stelle(n) und wichtigste Umsetzungspartner / Partner mit Leistungsverträgen",null,null,null,null,null,null,null,"z.B. Zuständige kantonale Stelle(n) und wichtigste Umsetzungspartner / Partner mit Leistungsverträgen",null,null,null,null,null,null,null,"z.B. Zuständige kantonale Stelle(n) und wichtigste Umsetzungspartner / Partner mit Leistungsverträgen",null,null,null,null,null,null,null,"z.B. Zuständige kantonale Stelle(n) und wichtigste Umsetzungspartner / Partner mit Leistungsverträgen",null,null,null,null,null,null,null,"z.B. Zuständige kantonale Stelle(n) und wichtigste Umsetzungspartner / Partner mit Leistungsverträgen",null,null,null,null,null,null,null,"z.B. Zuständige kantonale Stelle(n) und wichtigste Umsetzungspartner / Partner mit Leistungsverträgen",null,null,null,null,null,null,null,"z.B. Zuständige kantonale Stelle(n) und wichtigste Umsetzungspartner / Partner mit Leistungsverträgen",null,null,null,null,null,null,null,"z.B. Zuständige kantonale Stelle(n) und wichtigste Umsetzungspartner / Partner mit Leistungsverträgen",null,null,null,null,null,null,null,"z.B. Zuständige kantonale Stelle(n) und wichtigste Umsetzungspartner / Partner mit Leistungsverträgen",null,null,null,null,null,null,null,"z.B. Zuständige kantonale Stelle(n) und wichtigste Umsetzungspartner / Partner mit Leistungsverträgen",null,null,null,null,null,null,null,"z.B. Zuständige kantonale Stelle(n) und wichtigste Umsetzungspartner / Partner mit Leistungsverträgen",null,null,null,null,null,null,null,"z.B. Zuständige kantonale Stelle(n) und wichtigste Umsetzungspartner / Partner mit Leistungsverträgen",null,null,null,null,null,null,null,"z.B. Zuständige kantonale Stelle(n) und wichtigste Umsetzungspartner / Partner mit Leistungsverträgen",null,null,null,null,null,null,null,"z.B. Zuständige kantonale Stelle(n) und wichtigste Umsetzungspartner / Partner mit Leistungsverträgen",null,null,null,null,null,null,null,"z.B. Zuständige kantonale Stelle(n) und wichtigste Umsetzungspartner / Partner mit Leistungsverträgen",null,null,null,null,null,null,null,"z.B. Zuständige kantonale Stelle(n) und wichtigste Umsetzungspartner / Partner mit Leistungsverträgen",null,null,null,null,null,null,null,"z.B. Zuständige kantonale Stelle(n) und wichtigste Umsetzungspartner / Partner mit Leistungsverträgen",null,null,null,null,null,null,null,"z.B. Zuständige kantonale Stelle(n) und wichtigste Umsetzungspartner / Partner mit Leistungsverträgen",null,null,null,null,null,null,null,"z.B. Zuständige kantonale Stelle(n) und wichtigste Umsetzungspartner / Partner mit Leistungsverträgen",null,null,null,null,null,null,null,"z.B. Zuständige kantonale Stelle(n) und wichtigste Umsetzungspartner / Partner mit Leistungsverträgen",null,null,null,null,null,null,null,"z.B. Zuständige kantonale Stelle(n) und wichtigste Umsetzungspartner / Partner mit Leistungsverträgen",null,null,null,null,null,null,null,"z.B. Zuständige kantonale Stelle(n) und wichtigste Umsetzungspartner / Partner mit Leistungsverträgen",null,null,null,null,null,null,null,"z.B. Zuständige kantonale Stelle(n) und wichtigste Umsetzungspartner / Partner mit Leistungsverträgen",null,null,null,null,null,null,null,"z.B. Zuständige kantonale Stelle(n) und wichtigste Umsetzungspartner / Partner mit Leistungsverträgen",null,null,null,null,null,null,null,"z.B. Zuständige kantonale Stelle(n) und wichtigste Umsetzungspartner / Partner mit Leistungsverträgen",null,null,null,null,null,null,null,"z.B. Zuständige kantonale Stelle(n) und wichtigste Umsetzungspartner / Partner mit Leistungsverträgen",null,null,null,null,null,null,null,"z.B. Zuständige kantonale Stelle(n) und wichtigste Umsetzungspartner / Partner mit Leistungsverträgen",null,null,null,null,null,null,null,"z.B. Zuständige kantonale Stelle(n) und wichtigste Umsetzungspartner / Partner mit Leistungsverträgen",null,null,null,null,null,null,null,"z.B. Zuständige kantonale Stelle(n) und wichtigste Umsetzungspartner / Partner mit Leistungsverträgen",null,null,null,null,null,null,null,"z.B. Zuständige kantonale Stelle(n) und wichtigste Umsetzungspartner / Partner mit Leistungsverträgen",null,null,null,null,null,null,null,"z.B. Zuständige kantonale Stelle(n) und wichtigste Umsetzungspartner / Partner mit Leistungsverträgen",null,null,null,null,null,null,null,"z.B. Zuständige kantonale Stelle(n) und wichtigste Umsetzungspartner / Partner mit Leistungsverträgen",null,null,null,null,null,null,null,"z.B. Zuständige kantonale Stelle(n) und wichtigste Umsetzungspartner / Partner mit Leistungsverträgen",null,null,null,null,null,null,null,"z.B. Zuständige kantonale Stelle(n) und wichtigste Umsetzungspartner / Partner mit Leistungsverträgen",null,null,null,null,null,null,null,"z.B. Zuständige kantonale Stelle(n) und wichtigste Umsetzungspartner / Partner mit Leistungsverträgen",null,null,null,null,null,null,null,"z.B. Zuständige kantonale Stelle(n) und wichtigste Umsetzungspartner / Partner mit Leistungsverträgen",null,null,null,null,null,null,null,"z.B. Zuständige kantonale Stelle(n) und wichtigste Umsetzungspartner / Partner mit Leistungsverträgen",null,null,null,null,null,null,null,"z.B. Zuständige kantonale Stelle(n) und wichtigste Umsetzungspartner / Partner mit Leistungsverträgen",null,null,null,null,null,null,null,"z.B. Zuständige kantonale Stelle(n) und wichtigste Umsetzungspartner / Partner mit Leistungsverträgen",null,null,null,null,null,null,null,"z.B. Zuständige kantonale Stelle(n) und wichtigste Umsetzungspartner / Partner mit Leistungsverträgen",null,null,null,null,null,null,null,"z.B. Zuständige kantonale Stelle(n) und wichtigste Umsetzungspartner / Partner mit Leistungsverträgen",null,null,null,null,null,null,null,"z.B. Zuständige kantonale Stelle(n) und wichtigste Umsetzungspartner / Partner mit Leistungsverträgen",null,null,null,null,null,null,null,"z.B. Zuständige kantonale Stelle(n) und wichtigste Umsetzungspartner / Partner mit Leistungsverträgen",null,null,null,null,null,null,null,"z.B. Zuständige kantonale Stelle(n) und wichtigste Umsetzungspartner / Partner mit Leistungsverträgen",null,null,null,null,null,null,null,"z.B. Zuständige kantonale Stelle(n) und wichtigste Umsetzungspartner / Partner mit Leistungsverträgen",null,null,null,null,null,null,null,"z.B. Zuständige kantonale Stelle(n) und wichtigste Umsetzungspartner / Partner mit Leistungsverträgen",null,null,null,null,null,null,null,"z.B. Zuständige kantonale Stelle(n) und wichtigste Umsetzungspartner / Partner mit Leistungsverträgen",null,null,null,null,null,null,null,"z.B. Zuständige kantonale Stelle(n) und wichtigste Umsetzungspartner / Partner mit Leistungsverträgen",null,null,null,null,null,null,null,"z.B. Zuständige kantonale Stelle(n) und wichtigste Umsetzungspartner / Partner mit Leistungsverträgen",null,null,null,null,null,null,null,"z.B. Zuständige kantonale Stelle(n) und wichtigste Umsetzungspartner / Partner mit Leistungsverträgen",null,null,null,null,null,null,null,"z.B. Zuständige kantonale Stelle(n) und wichtigste Umsetzungspartner / Partner mit Leistungsverträgen",null,null,null,null,null,null,null,"z.B. Zuständige kantonale Stelle(n) und wichtigste Umsetzungspartner / Partner mit Leistungsverträgen",null,null,null,null,null,null,null,"z.B. Zuständige kantonale Stelle(n) und wichtigste Umsetzungspartner / Partner mit Leistungsverträgen",null,null,null,null,null,null,null,"z.B. Zuständige kantonale Stelle(n) und wichtigste Umsetzungspartner / Partner mit Leistungsverträgen",null,null,null,null,null,null,null,"z.B. Zuständige kantonale Stelle(n) und wichtigste Umsetzungspartner / Partner mit Leistungsverträgen",null,null,null,null,null,null,null,"z.B. Zuständige kantonale Stelle(n) und wichtigste Umsetzungspartner / Partner mit Leistungsverträgen",null,null,null,null,null,null,null,"z.B. Zuständige kantonale Stelle(n) und wichtigste Umsetzungspartner / Partner mit Leistungsverträgen",null,null,null,null,null,null,null,"z.B. Zuständige kantonale Stelle(n) und wichtigste Umsetzungspartner / Partner mit Leistungsverträgen",null,null,null,null,null,null,null,"z.B. Zuständige kantonale Stelle(n) und wichtigste Umsetzungspartner / Partner mit Leistungsverträgen",null,null,null,null,null,null,null,"z.B. Zuständige kantonale Stelle(n) und wichtigste Umsetzungspartner / Partner mit Leistungsverträgen",null,null,null,null,null,null,null,"z.B. Zuständige kantonale Stelle(n) und wichtigste Umsetzungspartner / Partner mit Leistungsverträgen",null,null,null,null,null,null,null,"z.B. Zuständige kantonale Stelle(n) und wichtigste Umsetzungspartner / Partner mit Leistungsverträgen",null,null,null,null,null,null,null,"z.B. Zuständige kantonale Stelle(n) und wichtigste Umsetzungspartner / Partner mit Leistungsverträgen",null,null,null,null,null,null,null,"z.B. Zuständige kantonale Stelle(n) und wichtigste Umsetzungspartner / Partner mit Leistungsverträgen",null,null,null,null,null,null,null,"z.B. Zuständige kantonale Stelle(n) und wichtigste Umsetzungspartner / Partner mit Leistungsverträgen",null,null,null,null,null,null,null,"z.B. Zuständige kantonale Stelle(n) und wichtigste Umsetzungspartner / Partner mit Leistungsverträgen",null,null,null,null,null,null,null,"z.B. Zuständige kantonale Stelle(n) und wichtigste Umsetzungspartner / Partner mit Leistungsverträgen",null,null,null,null,null,null,null,"z.B. Zuständige kantonale Stelle(n) und wichtigste Umsetzungspartner / Partner mit Leistungsverträgen",null,null,null,null,null,null,null,"z.B. Zuständige kantonale Stelle(n) und wichtigste Umsetzungspartner / Partner mit Leistungsverträgen",null,null,null,null,null,null,null,"z.B. Zuständige kantonale Stelle(n) und wichtigste Umsetzungspartner / Partner mit Leistungsverträgen",null,null,null,null,null,null,null,"z.B. Zuständige kantonale Stelle(n) und wichtigste Umsetzungspartner / Partner mit Leistungsverträgen",null,null,null,null,null,null,null,"z.B. Zuständige kantonale Stelle(n) und wichtigste Umsetzungspartner / Partner mit Leistungsverträgen",null,null,null,null,null,null,null,"z.B. Zuständige kantonale Stelle(n) und wichtigste Umsetzungspartner / Partner mit Leistungsverträgen",null,null,null,null,null,null,null,"z.B. Zuständige kantonale Stelle(n) und wichtigste Umsetzungspartner / Partner mit Leistungsverträgen",null,null,null,null,null,null,null,"z.B. Zuständige kantonale Stelle(n) und wichtigste Umsetzungspartner / Partner mit Leistungsverträgen",null,null,null,null,null,null,null,"z.B. Zuständige kantonale Stelle(n) und wichtigste Umsetzungspartner / Partner mit Leistungsverträgen",null,null,null,null,null,null,null,"z.B. Zuständige kantonale Stelle(n) und wichtigste Umsetzungspartner / Partner mit Leistungsverträgen",null,null,null,null,null,null,null,"z.B. Zuständige kantonale Stelle(n) und wichtigste Umsetzungspartner / Partner mit Leistungsverträgen",null,null,null,null,null,null,null,"z.B. Zuständige kantonale Stelle(n) und wichtigste Umsetzungspartner / Partner mit Leistungsverträgen",null,null,null,null,null,null,null,"z.B. Zuständige kantonale Stelle(n) und wichtigste Umsetzungspartner / Partner mit Leistungsverträgen",null,null,null,null,null,null,null,"z.B. Zuständige kantonale Stelle(n) und wichtigste Umsetzungspartner / Partner mit Leistungsverträgen",null,null,null,null,null,null,null,"z.B. Zuständige kantonale Stelle(n) und wichtigste Umsetzungspartner / Partner mit Leistungsverträgen",null,null,null,null,null,null,null,"z.B. Zuständige kantonale Stelle(n) und wichtigste Umsetzungspartner / Partner mit Leistungsverträgen",null,null,null,null,null,null,null,"z.B. Zuständige kantonale Stelle(n) und wichtigste Umsetzungspartner / Partner mit Leistungsverträgen",null,null,null,null,null,null,null,"z.B. Zuständige kantonale Stelle(n) und wichtigste Umsetzungspartner / Partner mit Leistungsverträgen",null,null,null,null,null,null,null,"z.B. Zuständige kantonale Stelle(n) und wichtigste Umsetzungspartner / Partner mit Leistungsverträgen",null,null,null,null,null,null,null,"z.B. Zuständige kantonale Stelle(n) und wichtigste Umsetzungspartner / Partner mit Leistungsverträgen",null,null,null,null,null,null,null,"z.B. Zuständige kantonale Stelle(n) und wichtigste Umsetzungspartner / Partner mit Leistungsverträgen",null,null,null,null,null,null,null,"z.B. Zuständige kantonale Stelle(n) und wichtigste Umsetzungspartner / Partner mit Leistungsverträgen",null,null,null,null,null,null,null,"z.B. Zuständige kantonale Stelle(n) und wichtigste Umsetzungspartner / Partner mit Leistungsverträgen",null,null,null,null,null,null,null,"z.B. Zuständige kantonale Stelle(n) und wichtigste Umsetzungspartner / Partner mit Leistungsverträgen",null,null,null,null,null,null,null,"z.B. Zuständige kantonale Stelle(n) und wichtigste Umsetzungspartner / Partner mit Leistungsverträgen",null,null,null,null,null,null,null,"z.B. Zuständige kantonale Stelle(n) und wichtigste Umsetzungspartner / Partner mit Leistungsverträgen",null,null,null,null,null,null,null,"z.B. Zuständige kantonale Stelle(n) und wichtigste Umsetzungspartner / Partner mit Leistungsverträgen",null,null,null,null,null,null,null,"z.B. Zuständige kantonale Stelle(n) und wichtigste Umsetzungspartner / Partner mit Leistungsverträgen",null,null,null,null,null,null,null,"z.B. Zuständige kantonale Stelle(n) und wichtigste Umsetzungspartner / Partner mit Leistungsverträgen",null,null,null,null,null,null,null,"z.B. Zuständige kantonale Stelle(n) und wichtigste Umsetzungspartner / Partner mit Leistungsverträgen",null,null,null,null,null,null,null,"z.B. Zuständige kantonale Stelle(n) und wichtigste Umsetzungspartner / Partner mit Leistungsverträgen",null,null,null,null,null,null,null,"z.B. Zuständige kantonale Stelle(n) und wichtigste Umsetzungspartner / Partner mit Leistungsverträgen",null,null,null,null,null,null,null,"z.B. Zuständige kantonale Stelle(n) und wichtigste Umsetzungspartner / Partner mit Leistungsverträgen",null,null,null,null,null,null,null,"z.B. Zuständige kantonale Stelle(n) und wichtigste Umsetzungspartner / Partner mit Leistungsverträgen",null,null,null,null,null,null,null,"z.B. Zuständige kantonale Stelle(n) und wichtigste Umsetzungspartner / Partner mit Leistungsverträgen",null,null,null,null,null,null,null,"z.B. Zuständige kantonale Stelle(n) und wichtigste Umsetzungspartner / Partner mit Leistungsverträgen",null,null,null,null,null,null,null,"z.B. Zuständige kantonale Stelle(n) und wichtigste Umsetzungspartner / Partner mit Leistungsverträgen",null,null,null,null,null,null,null,"z.B. Zuständige kantonale Stelle(n) und wichtigste Umsetzungspartner / Partner mit Leistungsverträgen",null,null,null,null,null,null,null,"z.B. Zuständige kantonale Stelle(n) und wichtigste Umsetzungspartner / Partner mit Leistungsverträgen",null,null,null,null,null,null,null,"z.B. Zuständige kantonale Stelle(n) und wichtigste Umsetzungspartner / Partner mit Leistungsverträgen",null,null,null,null,null,null,null,"z.B. Zuständige kantonale Stelle(n) und wichtigste Umsetzungspartner / Partner mit Leistungsverträgen",null,null,null,null,null,null,null,"z.B. Zuständige kantonale Stelle(n) und wichtigste Umsetzungspartner / Partner mit Leistungsverträgen",null,null,null,null,null,null,null,"z.B. Zuständige kantonale Stelle(n) und wichtigste Umsetzungspartner / Partner mit Leistungsverträgen",null,null,null,null,null,null,null,"z.B. Zuständige kantonale Stelle(n) und wichtigste Umsetzungspartner / Partner mit Leistungsverträgen",null,null,null,null,null,null,null,"z.B. Zuständige kantonale Stelle(n) und wichtigste Umsetzungspartner / Partner mit Leistungsverträgen",null,null,null,null,null,null,null,"z.B. Zuständige kantonale Stelle(n) und wichtigste Umsetzungspartner / Partner mit Leistungsverträgen",null,null,null,null,null,null,null,"z.B. Zuständige kantonale Stelle(n) und wichtigste Umsetzungspartner / Partner mit Leistungsverträgen",null,null,null,null,null,null,null,"z.B. Zuständige kantonale Stelle(n) und wichtigste Umsetzungspartner / Partner mit Leistungsverträgen",null,null,null,null,null,null,null,"z.B. Zuständige kantonale Stelle(n) und wichtigste Umsetzungspartner / Partner mit Leistungsverträgen",null,null,null,null,null,null,null,"z.B. Zuständige kantonale Stelle(n) und wichtigste Umsetzungspartner / Partner mit Leistungsverträgen",null,null,null,null,null,null,null,"z.B. Zuständige kantonale Stelle(n) und wichtigste Umsetzungspartner / Partner mit Leistungsverträgen",null,null,null,null,null,null,null,"z.B. Zuständige kantonale Stelle(n) und wichtigste Umsetzungspartner / Partner mit Leistungsverträgen",null,null,null,null,null,null,null,"z.B. Zuständige kantonale Stelle(n) und wichtigste Umsetzungspartner / Partner mit Leistungsverträgen",null,null,null,null,null,null,null,"z.B. Zuständige kantonale Stelle(n) und wichtigste Umsetzungspartner / Partner mit Leistungsverträgen",null,null,null,null,null,null,null,"z.B. Zuständige kantonale Stelle(n) und wichtigste Umsetzungspartner / Partner mit Leistungsverträgen",null,null,null,null,null,null,null,"z.B. Zuständige kantonale Stelle(n) und wichtigste Umsetzungspartner / Partner mit Leistungsverträgen",null,null,null,null,null,null,null,"z.B. Zuständige kantonale Stelle(n) und wichtigste Umsetzungspartner / Partner mit Leistungsverträgen",null,null,null,null,null,null,null,"z.B. Zuständige kantonale Stelle(n) und wichtigste Umsetzungspartner / Partner mit Leistungsverträgen",null,null,null,null,null,null,null,"z.B. Zuständige kantonale Stelle(n) und wichtigste Umsetzungspartner / Partner mit Leistungsverträgen",null,null,null,null,null,null,null,"z.B. Zuständige kantonale Stelle(n) und wichtigste Umsetzungspartner / Partner mit Leistungsverträgen",null,null,null,null,null,null,null,"z.B. Zuständige kantonale Stelle(n) und wichtigste Umsetzungspartner / Partner mit Leistungsverträgen",null,null,null,null,null,null,null,"z.B. Zuständige kantonale Stelle(n) und wichtigste Umsetzungspartner / Partner mit Leistungsverträgen",null,null,null,null,null,null,null,"z.B. Zuständige kantonale Stelle(n) und wichtigste Umsetzungspartner / Partner mit Leistungsverträgen",null,null,null,null,null,null,null,"z.B. Zuständige kantonale Stelle(n) und wichtigste Umsetzungspartner / Partner mit Leistungsverträgen",null,null,null,null,null,null,null,"z.B. Zuständige kantonale Stelle(n) und wichtigste Umsetzungspartner / Partner mit Leistungsverträgen",null,null,null,null,null,null,null,"z.B. Zuständige kantonale Stelle(n) und wichtigste Umsetzungspartner / Partner mit Leistungsverträgen",null,null,null,null,null,null,null,"z.B. Zuständige kantonale Stelle(n) und wichtigste Umsetzungspartner / Partner mit Leistungsverträgen",null,null,null,null,null,null,null,"z.B. Zuständige kantonale Stelle(n) und wichtigste Umsetzungspartner / Partner mit Leistungsverträgen",null,null,null,null,null,null,null,"z.B. Zuständige kantonale Stelle(n) und wichtigste Umsetzungspartner / Partner mit Leistungsverträgen",null,null,null,null,null,null,null,"z.B. Zuständige kantonale Stelle(n) und wichtigste Umsetzungspartner / Partner mit Leistungsverträgen",null,null,null,null,null,null,null,"z.B. Zuständige kantonale Stelle(n) und wichtigste Umsetzungspartner / Partner mit Leistungsverträgen",null,null,null,null,null,null,null,"z.B. Zuständige kantonale Stelle(n) und wichtigste Umsetzungspartner / Partner mit Leistungsverträgen",null,null,null,null,null,null,null,"z.B. Zuständige kantonale Stelle(n) und wichtigste Umsetzungspartner / Partner mit Leistungsverträgen",null,null,null,null,null,null,null,"z.B. Zuständige kantonale Stelle(n) und wichtigste Umsetzungspartner / Partner mit Leistungsverträgen",null,null,null,null,null,null,null,"z.B. Zuständige kantonale Stelle(n) und wichtigste Umsetzungspartner / Partner mit Leistungsverträgen",null,null,null,null,null,null,null,"z.B. Zuständige kantonale Stelle(n) und wichtigste Umsetzungspartner / Partner mit Leistungsverträgen",null,null,null,null,null,null,null,"z.B. Zuständige kantonale Stelle(n) und wichtigste Umsetzungspartner / Partner mit Leistungsverträgen",null,null,null,null,null,null,null,"z.B. Zuständige kantonale Stelle(n) und wichtigste Umsetzungspartner / Partner mit Leistungsverträgen",null,null,null,null,null,null,null,"z.B. Zuständige kantonale Stelle(n) und wichtigste Umsetzungspartner / Partner mit Leistungsverträgen",null,null,null,null,null,null,null,"z.B. Zuständige kantonale Stelle(n) und wichtigste Umsetzungspartner / Partner mit Leistungsverträgen",null,null,null,null,null,null,null,"z.B. Zuständige kantonale Stelle(n) und wichtigste Umsetzungspartner / Partner mit Leistungsverträgen",null,null,null,null,null,null,null,"z.B. Zuständige kantonale Stelle(n) und wichtigste Umsetzungspartner / Partner mit Leistungsverträgen",null,null,null,null,null,null,null,"z.B. Zuständige kantonale Stelle(n) und wichtigste Umsetzungspartner / Partner mit Leistungsverträgen",null,null,null,null,null,null,null,"z.B. Zuständige kantonale Stelle(n) und wichtigste Umsetzungspartner / Partner mit Leistungsverträgen",null,null,null,null,null,null,null,"z.B. Zuständige kantonale Stelle(n) und wichtigste Umsetzungspartner / Partner mit Leistungsverträgen",null,null,null,null,null,null,null,"z.B. Zuständige kantonale Stelle(n) und wichtigste Umsetzungspartner / Partner mit Leistungsverträgen",null,null,null,null,null,null,null,"z.B. Zuständige kantonale Stelle(n) und wichtigste Umsetzungspartner / Partner mit Leistungsverträgen",null,null,null,null,null,null,null,"z.B. Zuständige kantonale Stelle(n) und wichtigste Umsetzungspartner / Partner mit Leistungsverträgen",null,null,null,null,null,null,null,"z.B. Zuständige kantonale Stelle(n) und wichtigste Umsetzungspartner / Partner mit Leistungsverträgen",null,null,null,null,null,null,null,"z.B. Zuständige kantonale Stelle(n) und wichtigste Umsetzungspartner / Partner mit Leistungsverträgen",null,null,null,null,null,null,null,"z.B. Zuständige kantonale Stelle(n) und wichtigste Umsetzungspartner / Partner mit Leistungsverträgen",null,null,null,null,null,null,null,"z.B. Zuständige kantonale Stelle(n) und wichtigste Umsetzungspartner / Partner mit Leistungsverträgen",null,null,null,null,null,null,null,"z.B. Zuständige kantonale Stelle(n) und wichtigste Umsetzungspartner / Partner mit Leistungsverträgen",null,null,null,null,null,null,null,"z.B. Zuständige kantonale Stelle(n) und wichtigste Umsetzungspartner / Partner mit Leistungsverträgen",null,null,null,null,null,null,null,"z.B. Zuständige kantonale Stelle(n) und wichtigste Umsetzungspartner / Partner mit Leistungsverträgen",null,null,null,null,null,null,null,"z.B. Zuständige kantonale Stelle(n) und wichtigste Umsetzungspartner / Partner mit Leistungsverträgen",null,null,null,null,null,null,null,"z.B. Zuständige kantonale Stelle(n) und wichtigste Umsetzungspartner / Partner mit Leistungsverträgen",null,null,null,null,null,null,null,"z.B. Zuständige kantonale Stelle(n) und wichtigste Umsetzungspartner / Partner mit Leistungsverträgen",null,null,null,null,null,null,null,"z.B. Zuständige kantonale Stelle(n) und wichtigste Umsetzungspartner / Partner mit Leistungsverträgen",null,null,null,null,null,null,null,"z.B. Zuständige kantonale Stelle(n) und wichtigste Umsetzungspartner / Partner mit Leistungsverträgen",null,null,null,null,null,null,null,"z.B. Zuständige kantonale Stelle(n) und wichtigste Umsetzungspartner / Partner mit Leistungsverträgen",null,null,null,null,null,null,null,"z.B. Zuständige kantonale Stelle(n) und wichtigste Umsetzungspartner / Partner mit Leistungsverträgen",null,null,null,null,null,null,null,"z.B. Zuständige kantonale Stelle(n) und wichtigste Umsetzungspartner / Partner mit Leistungsverträgen",null,null,null,null,null,null,null,"z.B. Zuständige kantonale Stelle(n) und wichtigste Umsetzungspartner / Partner mit Leistungsverträgen",null,null,null,null,null,null,null,"z.B. Zuständige kantonale Stelle(n) und wichtigste Umsetzungspartner / Partner mit Leistungsverträgen",null,null,null,null,null,null,null,"z.B. Zuständige kantonale Stelle(n) und wichtigste Umsetzungspartner / Partner mit Leistungsverträgen",null,null,null,null,null,null,null,"z.B. Zuständige kantonale Stelle(n) und wichtigste Umsetzungspartner / Partner mit Leistungsverträgen",null,null,null,null,null,null,null,"z.B. Zuständige kantonale Stelle(n) und wichtigste Umsetzungspartner / Partner mit Leistungsverträgen",null,null,null,null,null,null,null,"z.B. Zuständige kantonale Stelle(n) und wichtigste Umsetzungspartner / Partner mit Leistungsverträgen",null,null,null,null,null,null,null,"z.B. Zuständige kantonale Stelle(n) und wichtigste Umsetzungspartner / Partner mit Leistungsverträgen",null,null,null,null,null,null,null,"z.B. Zuständige kantonale Stelle(n) und wichtigste Umsetzungspartner / Partner mit Leistungsverträgen",null,null,null,null,null,null,null,"z.B. Zuständige kantonale Stelle(n) und wichtigste Umsetzungspartner / Partner mit Leistungsverträgen",null,null,null,null,null,null,null,"z.B. Zuständige kantonale Stelle(n) und wichtigste Umsetzungspartner / Partner mit Leistungsverträgen",null,null,null,null,null,null,null,"z.B. Zuständige kantonale Stelle(n) und wichtigste Umsetzungspartner / Partner mit Leistungsverträgen",null,null,null,null,null,null,null,"z.B. Zuständige kantonale Stelle(n) und wichtigste Umsetzungspartner / Partner mit Leistungsverträgen",null,null,null,null,null,null,null,"z.B. Zuständige kantonale Stelle(n) und wichtigste Umsetzungspartner / Partner mit Leistungsverträgen",null,null,null,null,null,null,null,"z.B. Zuständige kantonale Stelle(n) und wichtigste Umsetzungspartner / Partner mit Leistungsverträgen",null,null,null,null,null,null,null,"z.B. Zuständige kantonale Stelle(n) und wichtigste Umsetzungspartner / Partner mit Leistungsverträgen",null,null,null,null,null,null,null,"z.B. Zuständige kantonale Stelle(n) und wichtigste Umsetzungspartner / Partner mit Leistungsverträgen",null,null,null,null,null,null,null,"z.B. Zuständige kantonale Stelle(n) und wichtigste Umsetzungspartner / Partner mit Leistungsverträgen",null,null,null,null,null,null,null,"z.B. Zuständige kantonale Stelle(n) und wichtigste Umsetzungspartner / Partner mit Leistungsverträgen",null,null,null,null,null,null,null,"z.B. Zuständige kantonale Stelle(n) und wichtigste Umsetzungspartner / Partner mit Leistungsverträgen",null,null,null,null,null,null,null,"z.B. Zuständige kantonale Stelle(n) und wichtigste Umsetzungspartner / Partner mit Leistungsverträgen",null,null,null,null,null,null,null,"z.B. Zuständige kantonale Stelle(n) und wichtigste Umsetzungspartner / Partner mit Leistungsverträgen",null,null,null,null,null,null,null,"z.B. Zuständige kantonale Stelle(n) und wichtigste Umsetzungspartner / Partner mit Leistungsverträgen",null,null,null,null,null,null,null,"z.B. Zuständige kantonale Stelle(n) und wichtigste Umsetzungspartner / Partner mit Leistungsverträgen",null,null,null,null,null,null,null,"z.B. Zuständige kantonale Stelle(n) und wichtigste Umsetzungspartner / Partner mit Leistungsverträgen",null,null,null,null,null,null,null,"z.B. Zuständige kantonale Stelle(n) und wichtigste Umsetzungspartner / Partner mit Leistungsverträgen",null,null,null,null,null,null,null,"z.B. Zuständige kantonale Stelle(n) und wichtigste Umsetzungspartner / Partner mit Leistungsverträgen",null,null,null,null,null,null,null,"z.B. Zuständige kantonale Stelle(n) und wichtigste Umsetzungspartner / Partner mit Leistungsverträgen",null,null,null,null,null,null,null,"z.B. Zuständige kantonale Stelle(n) und wichtigste Umsetzungspartner / Partner mit Leistungsverträgen",null,null,null,null,null,null,null,"z.B. Zuständige kantonale Stelle(n) und wichtigste Umsetzungspartner / Partner mit Leistungsverträgen",null,null,null,null,null,null,null,"z.B. Zuständige kantonale Stelle(n) und wichtigste Umsetzungspartner / Partner mit Leistungsverträgen",null,null,null,null,null,null,null,"z.B. Zuständige kantonale Stelle(n) und wichtigste Umsetzungspartner / Partner mit Leistungsverträgen",null,null,null,null,null,null,null,"z.B. Zuständige kantonale Stelle(n) und wichtigste Umsetzungspartner / Partner mit Leistungsverträgen",null,null,null,null,null,null,null,"z.B. Zuständige kantonale Stelle(n) und wichtigste Umsetzungspartner / Partner mit Leistungsverträgen",null,null,null,null,null,null,null,"z.B. Zuständige kantonale Stelle(n) und wichtigste Umsetzungspartner / Partner mit Leistungsverträgen",null,null,null,null,null,null,null,"z.B. Zuständige kantonale Stelle(n) und wichtigste Umsetzungspartner / Partner mit Leistungsverträgen",null,null,null,null,null,null,null,"z.B. Zuständige kantonale Stelle(n) und wichtigste Umsetzungspartner / Partner mit Leistungsverträgen",null,null,null,null,null,null,null,"z.B. Zuständige kantonale Stelle(n) und wichtigste Umsetzungspartner / Partner mit Leistungsverträgen",null,null,null,null,null,null,null,"z.B. Zuständige kantonale Stelle(n) und wichtigste Umsetzungspartner / Partner mit Leistungsverträgen",null,null,null,null,null,null,null,"z.B. Zuständige kantonale Stelle(n) und wichtigste Umsetzungspartner / Partner mit Leistungsverträgen",null,null,null,null,null,null,null,"z.B. Zuständige kantonale Stelle(n) und wichtigste Umsetzungspartner / Partner mit Leistungsverträgen",null,null,null,null,null,null,null,"z.B. Zuständige kantonale Stelle(n) und wichtigste Umsetzungspartner / Partner mit Leistungsverträgen",null,null,null,null,null,null,null,"z.B. Zuständige kantonale Stelle(n) und wichtigste Umsetzungspartner / Partner mit Leistungsverträgen",null,null,null,null,null,null,null,"z.B. Zuständige kantonale Stelle(n) und wichtigste Umsetzungspartner / Partner mit Leistungsverträgen",null,null,null,null,null,null,null,"z.B. Zuständige kantonale Stelle(n) und wichtigste Umsetzungspartner / Partner mit Leistungsverträgen",null,null,null,null,null,null,null,"z.B. Zuständige kantonale Stelle(n) und wichtigste Umsetzungspartner / Partner mit Leistungsverträgen",null,null,null,null,null,null,null,"z.B. Zuständige kantonale Stelle(n) und wichtigste Umsetzungspartner / Partner mit Leistungsverträgen",null,null,null,null,null,null,null,"z.B. Zuständige kantonale Stelle(n) und wichtigste Umsetzungspartner / Partner mit Leistungsverträgen",null,null,null,null,null,null,null,"z.B. Zuständige kantonale Stelle(n) und wichtigste Umsetzungspartner / Partner mit Leistungsverträgen",null,null,null,null,null,null,null,"z.B. Zuständige kantonale Stelle(n) und wichtigste Umsetzungspartner / Partner mit Leistungsverträgen",null,null,null,null,null,null,null,"z.B. Zuständige kantonale Stelle(n) und wichtigste Umsetzungspartner / Partner mit Leistungsverträgen",null,null,null,null,null,null,null,"z.B. Zuständige kantonale Stelle(n) und wichtigste Umsetzungspartner / Partner mit Leistungsverträgen",null,null,null,null,null,null,null,"z.B. Zuständige kantonale Stelle(n) und wichtigste Umsetzungspartner / Partner mit Leistungsverträgen",null,null,null,null,null,null,null,"z.B. Zuständige kantonale Stelle(n) und wichtigste Umsetzungspartner / Partner mit Leistungsverträgen",null,null,null,null,null,null,null,"z.B. Zuständige kantonale Stelle(n) und wichtigste Umsetzungspartner / Partner mit Leistungsverträgen",null,null,null,null,null,null,null,"z.B. Zuständige kantonale Stelle(n) und wichtigste Umsetzungspartner / Partner mit Leistungsverträgen",null,null,null,null,null,null,null,"z.B. Zuständige kantonale Stelle(n) und wichtigste Umsetzungspartner / Partner mit Leistungsverträgen",null,null,null,null,null,null,null,"z.B. Zuständige kantonale Stelle(n) und wichtigste Umsetzungspartner / Partner mit Leistungsverträgen",null,null,null,null,null,null,null,"z.B. Zuständige kantonale Stelle(n) und wichtigste Umsetzungspartner / Partner mit Leistungsverträgen",null,null,null,null,null,null,null,"z.B. Zuständige kantonale Stelle(n) und wichtigste Umsetzungspartner / Partner mit Leistungsverträgen",null,null,null,null,null,null,null,"z.B. Zuständige kantonale Stelle(n) und wichtigste Umsetzungspartner / Partner mit Leistungsverträgen",null,null,null,null,null,null,null,"z.B. Zuständige kantonale Stelle(n) und wichtigste Umsetzungspartner / Partner mit Leistungsverträgen",null,null,null,null,null,null,null,"z.B. Zuständige kantonale Stelle(n) und wichtigste Umsetzungspartner / Partner mit Leistungsverträgen",null,null,null,null,null,null,null,"z.B. Zuständige kantonale Stelle(n) und wichtigste Umsetzungspartner / Partner mit Leistungsverträgen",null,null,null,null,null,null,null,"z.B. Zuständige kantonale Stelle(n) und wichtigste Umsetzungspartner / Partner mit Leistungsverträgen",null,null,null,null,null,null,null,"z.B. Zuständige kantonale Stelle(n) und wichtigste Umsetzungspartner / Partner mit Leistungsverträgen",null,null,null,null,null,null,null,"z.B. Zuständige kantonale Stelle(n) und wichtigste Umsetzungspartner / Partner mit Leistungsverträgen",null,null,null,null,null,null,null,"z.B. Zuständige kantonale Stelle(n) und wichtigste Umsetzungspartner / Partner mit Leistungsverträgen",null,null,null,null,null,null,null,"z.B. Zuständige kantonale Stelle(n) und wichtigste Umsetzungspartner / Partner mit Leistungsverträgen",null,null,null,null,null,null,null,"z.B. Zuständige kantonale Stelle(n) und wichtigste Umsetzungspartner / Partner mit Leistungsverträgen",null,null,null,null,null,null,null,"z.B. Zuständige kantonale Stelle(n) und wichtigste Umsetzungspartner / Partner mit Leistungsverträgen",null,null,null,null,null,null,null,"z.B. Zuständige kantonale Stelle(n) und wichtigste Umsetzungspartner / Partner mit Leistungsverträgen",null,null,null,null,null,null,null,"z.B. Zuständige kantonale Stelle(n) und wichtigste Umsetzungspartner / Partner mit Leistungsverträgen",null,null,null,null,null,null,null,"z.B. Zuständige kantonale Stelle(n) und wichtigste Umsetzungspartner / Partner mit Leistungsverträgen",null,null,null,null,null,null,null,"z.B. Zuständige kantonale Stelle(n) und wichtigste Umsetzungspartner / Partner mit Leistungsverträgen",null,null,null,null,null,null,null,"z.B. Zuständige kantonale Stelle(n) und wichtigste Umsetzungspartner / Partner mit Leistungsverträgen",null,null,null,null,null,null,null,"z.B. Zuständige kantonale Stelle(n) und wichtigste Umsetzungspartner / Partner mit Leistungsverträgen",null,null,null,null,null,null,null,"z.B. Zuständige kantonale Stelle(n) und wichtigste Umsetzungspartner / Partner mit Leistungsverträgen",null,null,null,null,null,null,null,"z.B. Zuständige kantonale Stelle(n) und wichtigste Umsetzungspartner / Partner mit Leistungsverträgen",null,null,null,null,null,null,null,"z.B. Zuständige kantonale Stelle(n) und wichtigste Umsetzungspartner / Partner mit Leistungsverträgen",null,null,null,null,null,null,null,"z.B. Zuständige kantonale Stelle(n) und wichtigste Umsetzungspartner / Partner mit Leistungsverträgen",null,null,null,null,null,null,null,"z.B. Zuständige kantonale Stelle(n) und wichtigste Umsetzungspartner / Partner mit Leistungsverträgen",null,null,null,null,null,null,null,"z.B. Zuständige kantonale Stelle(n) und wichtigste Umsetzungspartner / Partner mit Leistungsverträgen",null,null,null,null,null,null,null,"z.B. Zuständige kantonale Stelle(n) und wichtigste Umsetzungspartner / Partner mit Leistungsverträgen",null,null,null,null,null,null,null,"z.B. Zuständige kantonale Stelle(n) und wichtigste Umsetzungspartner / Partner mit Leistungsverträgen",null,null,null,null,null,null,null,"z.B. Zuständige kantonale Stelle(n) und wichtigste Umsetzungspartner / Partner mit Leistungsverträgen",null,null,null,null,null,null,null,"z.B. Zuständige kantonale Stelle(n) und wichtigste Umsetzungspartner / Partner mit Leistungsverträgen",null,null,null,null,null,null,null,"z.B. Zuständige kantonale Stelle(n) und wichtigste Umsetzungspartner / Partner mit Leistungsverträgen",null,null,null,null,null,null,null,"z.B. Zuständige kantonale Stelle(n) und wichtigste Umsetzungspartner / Partner mit Leistungsverträgen",null,null,null,null,null,null,null,"z.B. Zuständige kantonale Stelle(n) und wichtigste Umsetzungspartner / Partner mit Leistungsverträgen",null,null,null,null,null,null,null,"z.B. Zuständige kantonale Stelle(n) und wichtigste Umsetzungspartner / Partner mit Leistungsverträgen",null,null,null,null,null,null,null,"z.B. Zuständige kantonale Stelle(n) und wichtigste Umsetzungspartner / Partner mit Leistungsverträgen",null,null,null,null,null,null,null,"z.B. Zuständige kantonale Stelle(n) und wichtigste Umsetzungspartner / Partner mit Leistungsverträgen",null,null,null,null,null,null,null,"z.B. Zuständige kantonale Stelle(n) und wichtigste Umsetzungspartner / Partner mit Leistungsverträgen",null,null,null,null,null,null,null,"z.B. Zuständige kantonale Stelle(n) und wichtigste Umsetzungspartner / Partner mit Leistungsverträgen",null,null,null,null,null,null,null,"z.B. Zuständige kantonale Stelle(n) und wichtigste Umsetzungspartner / Partner mit Leistungsverträgen",null,null,null,null,null,null,null,"z.B. Zuständige kantonale Stelle(n) und wichtigste Umsetzungspartner / Partner mit Leistungsverträgen",null,null,null,null,null,null,null,"z.B. Zuständige kantonale Stelle(n) und wichtigste Umsetzungspartner / Partner mit Leistungsverträgen",null,null,null,null,null,null,null,"z.B. Zuständige kantonale Stelle(n) und wichtigste Umsetzungspartner / Partner mit Leistungsverträgen",null,null,null,null,null,null,null,"z.B. Zuständige kantonale Stelle(n) und wichtigste Umsetzungspartner / Partner mit Leistungsverträgen",null,null,null,null,null,null,null,"z.B. Zuständige kantonale Stelle(n) und wichtigste Umsetzungspartner / Partner mit Leistungsverträgen",null,null,null,null,null,null,null,"z.B. Zuständige kantonale Stelle(n) und wichtigste Umsetzungspartner / Partner mit Leistungsverträgen",null,null,null,null,null,null,null,"z.B. Zuständige kantonale Stelle(n) und wichtigste Umsetzungspartner / Partner mit Leistungsverträgen",null,null,null,null,null,null,null,"z.B. Zuständige kantonale Stelle(n) und wichtigste Umsetzungspartner / Partner mit Leistungsverträgen",null,null,null,null,null,null,null,"z.B. Zuständige kantonale Stelle(n) und wichtigste Umsetzungspartner / Partner mit Leistungsverträgen",null,null,null,null,null,null,null,"z.B. Zuständige kantonale Stelle(n) und wichtigste Umsetzungspartner / Partner mit Leistungsverträgen",null,null,null,null,null,null,null,"z.B. Zuständige kantonale Stelle(n) und wichtigste Umsetzungspartner / Partner mit Leistungsverträgen",null,null,null,null,null,null,null,"z.B. Zuständige kantonale Stelle(n) und wichtigste Umsetzungspartner / Partner mit Leistungsverträgen",null,null,null,null,null,null,null,"z.B. Zuständige kantonale Stelle(n) und wichtigste Umsetzungspartner / Partner mit Leistungsverträgen",null,null,null,null,null,null,null,"z.B. Zuständige kantonale Stelle(n) und wichtigste Umsetzungspartner / Partner mit Leistungsverträgen",null,null,null,null,null,null,null,"z.B. Zuständige kantonale Stelle(n) und wichtigste Umsetzungspartner / Partner mit Leistungsverträgen",null,null,null,null,null,null,null,"z.B. Zuständige kantonale Stelle(n) und wichtigste Umsetzungspartner / Partner mit Leistungsverträgen",null,null,null,null,null,null,null,"z.B. Zuständige kantonale Stelle(n) und wichtigste Umsetzungspartner / Partner mit Leistungsverträgen",null,null,null,null,null,null,null,"z.B. Zuständige kantonale Stelle(n) und wichtigste Umsetzungspartner / Partner mit Leistungsverträgen",null,null,null,null,null,null,null,"z.B. Zuständige kantonale Stelle(n) und wichtigste Umsetzungspartner / Partner mit Leistungsverträgen",null,null,null,null,null,null,null,"z.B. Zuständige kantonale Stelle(n) und wichtigste Umsetzungspartner / Partner mit Leistungsverträgen",null,null,null,null,null,null,null,"z.B. Zuständige kantonale Stelle(n) und wichtigste Umsetzungspartner / Partner mit Leistungsverträgen",null,null,null,null,null,null,null,"z.B. Zuständige kantonale Stelle(n) und wichtigste Umsetzungspartner / Partner mit Leistungsverträgen",null,null,null,null,null,null,null,"z.B. Zuständige kantonale Stelle(n) und wichtigste Umsetzungspartner / Partner mit Leistungsverträgen",null,null,null,null,null,null,null,"z.B. Zuständige kantonale Stelle(n) und wichtigste Umsetzungspartner / Partner mit Leistungsverträgen",null,null,null,null,null,null,null,"z.B. Zuständige kantonale Stelle(n) und wichtigste Umsetzungspartner / Partner mit Leistungsverträgen",null,null,null,null,null,null,null,"z.B. Zuständige kantonale Stelle(n) und wichtigste Umsetzungspartner / Partner mit Leistungsverträgen",null,null,null,null,null,null,null,"z.B. Zuständige kantonale Stelle(n) und wichtigste Umsetzungspartner / Partner mit Leistungsverträgen",null,null,null,null,null,null,null,"z.B. Zuständige kantonale Stelle(n) und wichtigste Umsetzungspartner / Partner mit Leistungsverträgen",null,null,null,null,null,null,null,"z.B. Zuständige kantonale Stelle(n) und wichtigste Umsetzungspartner / Partner mit Leistungsverträgen",null,null,null,null,null,null,null,"z.B. Zuständige kantonale Stelle(n) und wichtigste Umsetzungspartner / Partner mit Leistungsverträgen",null,null,null,null,null,null,null,"z.B. Zuständige kantonale Stelle(n) und wichtigste Umsetzungspartner / Partner mit Leistungsverträgen",null,null,null,null,null,null,null,"z.B. Zuständige kantonale Stelle(n) und wichtigste Umsetzungspartner / Partner mit Leistungsverträgen",null,null,null,null,null,null,null,"z.B. Zuständige kantonale Stelle(n) und wichtigste Umsetzungspartner / Partner mit Leistungsverträgen",null,null,null,null,null,null,null,"z.B. Zuständige kantonale Stelle(n) und wichtigste Umsetzungspartner / Partner mit Leistungsverträgen",null,null,null,null,null,null,null,"z.B. Zuständige kantonale Stelle(n) und wichtigste Umsetzungspartner / Partner mit Leistungsverträgen",null,null,null,null,null,null,null,"z.B. Zuständige kantonale Stelle(n) und wichtigste Umsetzungspartner / Partner mit Leistungsverträgen",null,null,null,null,null,null,null,"z.B. Zuständige kantonale Stelle(n) und wichtigste Umsetzungspartner / Partner mit Leistungsverträgen",null,null,null,null,null,null,null,"z.B. Zuständige kantonale Stelle(n) und wichtigste Umsetzungspartner / Partner mit Leistungsverträgen",null,null,null,null,null,null,null,"z.B. Zuständige kantonale Stelle(n) und wichtigste Umsetzungspartner / Partner mit Leistungsverträgen",null,null,null,null,null,null,null,"z.B. Zuständige kantonale Stelle(n) und wichtigste Umsetzungspartner / Partner mit Leistungsverträgen",null,null,null,null,null,null,null,"z.B. Zuständige kantonale Stelle(n) und wichtigste Umsetzungspartner / Partner mit Leistungsverträgen",null,null,null,null,null,null,null,"z.B. Zuständige kantonale Stelle(n) und wichtigste Umsetzungspartner / Partner mit Leistungsverträgen",null,null,null,null,null,null,null,"z.B. Zuständige kantonale Stelle(n) und wichtigste Umsetzungspartner / Partner mit Leistungsverträgen",null,null,null,null,null,null,null,"z.B. Zuständige kantonale Stelle(n) und wichtigste Umsetzungspartner / Partner mit Leistungsverträgen",null,null,null,null,null,null,null,"z.B. Zuständige kantonale Stelle(n) und wichtigste Umsetzungspartner / Partner mit Leistungsverträgen",null,null,null,null,null,null,null,"z.B. Zuständige kantonale Stelle(n) und wichtigste Umsetzungspartner / Partner mit Leistungsverträgen",null,null,null,null,null,null,null,"z.B. Zuständige kantonale Stelle(n) und wichtigste Umsetzungspartner / Partner mit Leistungsverträgen",null,null,null,null,null,null,null,"z.B. Zuständige kantonale Stelle(n) und wichtigste Umsetzungspartner / Partner mit Leistungsverträgen",null,null,null,null,null,null,null,"z.B. Zuständige kantonale Stelle(n) und wichtigste Umsetzungspartner / Partner mit Leistungsverträgen",null,null,null,null,null,null,null,"z.B. Zuständige kantonale Stelle(n) und wichtigste Umsetzungspartner / Partner mit Leistungsverträgen",null,null,null,null,null,null,null,"z.B. Zuständige kantonale Stelle(n) und wichtigste Umsetzungspartner / Partner mit Leistungsverträgen",null,null,null,null,null,null,null,"z.B. Zuständige kantonale Stelle(n) und wichtigste Umsetzungspartner / Partner mit Leistungsverträgen",null,null,null,null,null,null,null,"z.B. Zuständige kantonale Stelle(n) und wichtigste Umsetzungspartner / Partner mit Leistungsverträgen",null,null,null,null,null,null,null,"z.B. Zuständige kantonale Stelle(n) und wichtigste Umsetzungspartner / Partner mit Leistungsverträgen",null,null,null,null,null,null,null,"z.B. Zuständige kantonale Stelle(n) und wichtigste Umsetzungspartner / Partner mit Leistungsverträgen",null,null,null,null,null,null,null,"z.B. Zuständige kantonale Stelle(n) und wichtigste Umsetzungspartner / Partner mit Leistungsverträgen",null,null,null,null,null,null,null,"z.B. Zuständige kantonale Stelle(n) und wichtigste Umsetzungspartner / Partner mit Leistungsverträgen",null,null,null,null,null,null,null,"z.B. Zuständige kantonale Stelle(n) und wichtigste Umsetzungspartner / Partner mit Leistungsverträgen",null,null,null,null,null,null,null,"z.B. Zuständige kantonale Stelle(n) und wichtigste Umsetzungspartner / Partner mit Leistungsverträgen",null,null,null,null,null,null,null,"z.B. Zuständige kantonale Stelle(n) und wichtigste Umsetzungspartner / Partner mit Leistungsverträgen",null,null,null,null,null,null,null,"z.B. Zuständige kantonale Stelle(n) und wichtigste Umsetzungspartner / Partner mit Leistungsverträgen",null,null,null,null,null,null,null,"z.B. Zuständige kantonale Stelle(n) und wichtigste Umsetzungspartner / Partner mit Leistungsverträgen",null,null,null,null,null,null,null,"z.B. Zuständige kantonale Stelle(n) und wichtigste Umsetzungspartner / Partner mit Leistungsverträgen",null,null,null,null,null,null,null,"z.B. Zuständige kantonale Stelle(n) und wichtigste Umsetzungspartner / Partner mit Leistungsverträgen",null,null,null,null,null,null,null,"z.B. Zuständige kantonale Stelle(n) und wichtigste Umsetzungspartner / Partner mit Leistungsverträgen",null,null,null,null,null,null,null,"z.B. Zuständige kantonale Stelle(n) und wichtigste Umsetzungspartner / Partner mit Leistungsverträgen",null,null,null,null,null,null,null,"z.B. Zuständige kantonale Stelle(n) und wichtigste Umsetzungspartner / Partner mit Leistungsverträgen",null,null,null,null,null,null,null,"z.B. Zuständige kantonale Stelle(n) und wichtigste Umsetzungspartner / Partner mit Leistungsverträgen",null,null,null,null,null,null,null,"z.B. Zuständige kantonale Stelle(n) und wichtigste Umsetzungspartner / Partner mit Leistungsverträgen",null,null,null,null,null,null,null,"z.B. Zuständige kantonale Stelle(n) und wichtigste Umsetzungspartner / Partner mit Leistungsverträgen",null,null,null,null,null,null,null,"z.B. Zuständige kantonale Stelle(n) und wichtigste Umsetzungspartner / Partner mit Leistungsverträgen",null,null,null,null,null,null,null,"z.B. Zuständige kantonale Stelle(n) und wichtigste Umsetzungspartner / Partner mit Leistungsverträgen",null,null,null,null,null,null,null,"z.B. Zuständige kantonale Stelle(n) und wichtigste Umsetzungspartner / Partner mit Leistungsverträgen",null,null,null,null,null,null,null,"z.B. Zuständige kantonale Stelle(n) und wichtigste Umsetzungspartner / Partner mit Leistungsverträgen",null,null,null,null,null,null,null,"z.B. Zuständige kantonale Stelle(n) und wichtigste Umsetzungspartner / Partner mit Leistungsverträgen",null,null,null,null,null,null,null,"z.B. Zuständige kantonale Stelle(n) und wichtigste Umsetzungspartner / Partner mit Leistungsverträgen",null,null,null,null,null,null,null,"z.B. Zuständige kantonale Stelle(n) und wichtigste Umsetzungspartner / Partner mit Leistungsverträgen",null,null,null,null,null,null,null,"z.B. Zuständige kantonale Stelle(n) und wichtigste Umsetzungspartner / Partner mit Leistungsverträgen",null,null,null,null,null,null,null,"z.B. Zuständige kantonale Stelle(n) und wichtigste Umsetzungspartner / Partner mit Leistungsverträgen",null,null,null,null,null,null,null,"z.B. Zuständige kantonale Stelle(n) und wichtigste Umsetzungspartner / Partner mit Leistungsverträgen",null,null,null,null,null,null,null,"z.B. Zuständige kantonale Stelle(n) und wichtigste Umsetzungspartner / Partner mit Leistungsverträgen",null,null,null,null,null,null,null,"z.B. Zuständige kantonale Stelle(n) und wichtigste Umsetzungspartner / Partner mit Leistungsverträgen",null,null,null,null,null,null,null,"z.B. Zuständige kantonale Stelle(n) und wichtigste Umsetzungspartner / Partner mit Leistungsverträgen",null,null,null,null,null,null,null,"z.B. Zuständige kantonale Stelle(n) und wichtigste Umsetzungspartner / Partner mit Leistungsverträgen",null,null,null,null,null,null,null,"z.B. Zuständige kantonale Stelle(n) und wichtigste Umsetzungspartner / Partner mit Leistungsverträgen",null,null,null,null,null,null,null,"z.B. Zuständige kantonale Stelle(n) und wichtigste Umsetzungspartner / Partner mit Leistungsverträgen",null,null,null,null,null,null,null,"z.B. Zuständige kantonale Stelle(n) und wichtigste Umsetzungspartner / Partner mit Leistungsverträgen",null,null,null,null,null,null,null,"z.B. Zuständige kantonale Stelle(n) und wichtigste Umsetzungspartner / Partner mit Leistungsverträgen",null,null,null,null,null,null,null,"z.B. Zuständige kantonale Stelle(n) und wichtigste Umsetzungspartner / Partner mit Leistungsverträgen",null,null,null,null,null,null,null,"z.B. Zuständige kantonale Stelle(n) und wichtigste Umsetzungspartner / Partner mit Leistungsverträgen",null,null,null,null,null,null,null,"z.B. Zuständige kantonale Stelle(n) und wichtigste Umsetzungspartner / Partner mit Leistungsverträgen",null,null,null,null,null,null,null,"z.B. Zuständige kantonale Stelle(n) und wichtigste Umsetzungspartner / Partner mit Leistungsverträgen",null,null,null,null,null,null,null,"z.B. Zuständige kantonale Stelle(n) und wichtigste Umsetzungspartner / Partner mit Leistungsverträgen",null,null,null,null,null,null,null,"z.B. Zuständige kantonale Stelle(n) und wichtigste Umsetzungspartner / Partner mit Leistungsverträgen",null,null,null,null,null,null,null,"z.B. Zuständige kantonale Stelle(n) und wichtigste Umsetzungspartner / Partner mit Leistungsverträgen",null,null,null,null,null,null,null,"z.B. Zuständige kantonale Stelle(n) und wichtigste Umsetzungspartner / Partner mit Leistungsverträgen",null,null,null,null,null,null,null,"z.B. Zuständige kantonale Stelle(n) und wichtigste Umsetzungspartner / Partner mit Leistungsverträgen",null,null,null,null,null,null,null,"z.B. Zuständige kantonale Stelle(n) und wichtigste Umsetzungspartner / Partner mit Leistungsverträgen",null,null,null,null,null,null,null,"z.B. Zuständige kantonale Stelle(n) und wichtigste Umsetzungspartner / Partner mit Leistungsverträgen",null,null,null,null,null,null,null,"z.B. Zuständige kantonale Stelle(n) und wichtigste Umsetzungspartner / Partner mit Leistungsverträgen",null,null,null,null,null,null,null,"z.B. Zuständige kantonale Stelle(n) und wichtigste Umsetzungspartner / Partner mit Leistungsverträgen",null,null,null,null,null,null,null,"z.B. Zuständige kantonale Stelle(n) und wichtigste Umsetzungspartner / Partner mit Leistungsverträgen",null,null,null,null,null,null,null,"z.B. Zuständige kantonale Stelle(n) und wichtigste Umsetzungspartner / Partner mit Leistungsverträgen",null,null,null,null,null,null,null,"z.B. Zuständige kantonale Stelle(n) und wichtigste Umsetzungspartner / Partner mit Leistungsverträgen",null,null,null,null,null,null,null,"z.B. Zuständige kantonale Stelle(n) und wichtigste Umsetzungspartner / Partner mit Leistungsverträgen",null,null,null,null,null,null,null,"z.B. Zuständige kantonale Stelle(n) und wichtigste Umsetzungspartner / Partner mit Leistungsverträgen",null,null,null,null,null,null,null,"z.B. Zuständige kantonale Stelle(n) und wichtigste Umsetzungspartner / Partner mit Leistungsverträgen",null,null,null,null,null,null,null,"z.B. Zuständige kantonale Stelle(n) und wichtigste Umsetzungspartner / Partner mit Leistungsverträgen",null,null,null,null,null,null,null,"z.B. Zuständige kantonale Stelle(n) und wichtigste Umsetzungspartner / Partner mit Leistungsverträgen",null,null,null,null,null,null,null,"z.B. Zuständige kantonale Stelle(n) und wichtigste Umsetzungspartner / Partner mit Leistungsverträgen",null,null,null,null,null,null,null,"z.B. Zuständige kantonale Stelle(n) und wichtigste Umsetzungspartner / Partner mit Leistungsverträgen",null,null,null,null,null,null,null,"z.B. Zuständige kantonale Stelle(n) und wichtigste Umsetzungspartner / Partner mit Leistungsverträgen",null,null,null,null,null,null,null,"z.B. Zuständige kantonale Stelle(n) und wichtigste Umsetzungspartner / Partner mit Leistungsverträgen",null,null,null,null,null,null,null,"z.B. Zuständige kantonale Stelle(n) und wichtigste Umsetzungspartner / Partner mit Leistungsverträgen",null,null,null,null,null,null,null,"z.B. Zuständige kantonale Stelle(n) und wichtigste Umsetzungspartner / Partner mit Leistungsverträgen",null,null,null,null,null,null,null,"z.B. Zuständige kantonale Stelle(n) und wichtigste Umsetzungspartner / Partner mit Leistungsverträgen",null,null,null,null,null,null,null,"z.B. Zuständige kantonale Stelle(n) und wichtigste Umsetzungspartner / Partner mit Leistungsverträgen",null,null,null,null,null,null,null,"z.B. Zuständige kantonale Stelle(n) und wichtigste Umsetzungspartner / Partner mit Leistungsverträgen",null,null,null,null,null,null,null,"z.B. Zuständige kantonale Stelle(n) und wichtigste Umsetzungspartner / Partner mit Leistungsverträgen",null,null,null,null,null,null,null,"z.B. Zuständige kantonale Stelle(n) und wichtigste Umsetzungspartner / Partner mit Leistungsverträgen",null,null,null,null,null,null,null,"z.B. Zuständige kantonale Stelle(n) und wichtigste Umsetzungspartner / Partner mit Leistungsverträgen",null,null,null,null,null,null,null,"z.B. Zuständige kantonale Stelle(n) und wichtigste Umsetzungspartner / Partner mit Leistungsverträgen",null,null,null,null,null,null,null,"z.B. Zuständige kantonale Stelle(n) und wichtigste Umsetzungspartner / Partner mit Leistungsverträgen",null,null,null,null,null,null,null,"z.B. Zuständige kantonale Stelle(n) und wichtigste Umsetzungspartner / Partner mit Leistungsverträgen",null,null,null,null,null,null,null,"z.B. Zuständige kantonale Stelle(n) und wichtigste Umsetzungspartner / Partner mit Leistungsverträgen",null,null,null,null,null,null,null,"z.B. Zuständige kantonale Stelle(n) und wichtigste Umsetzungspartner / Partner mit Leistungsverträgen",null,null,null,null,null,null,null,"z.B. Zuständige kantonale Stelle(n) und wichtigste Umsetzungspartner / Partner mit Leistungsverträgen",null,null,null,null,null,null,null,"z.B. Zuständige kantonale Stelle(n) und wichtigste Umsetzungspartner / Partner mit Leistungsverträgen",null,null,null,null,null,null,null,"z.B. Zuständige kantonale Stelle(n) und wichtigste Umsetzungspartner / Partner mit Leistungsverträgen",null,null,null,null,null,null,null,"z.B. Zuständige kantonale Stelle(n) und wichtigste Umsetzungspartner / Partner mit Leistungsverträgen",null,null,null,null,null,null,null,"z.B. Zuständige kantonale Stelle(n) und wichtigste Umsetzungspartner / Partner mit Leistungsverträgen",null,null,null,null,null,null,null,"z.B. Zuständige kantonale Stelle(n) und wichtigste Umsetzungspartner / Partner mit Leistungsverträgen",null,null,null,null,null,null,null,"z.B. Zuständige kantonale Stelle(n) und wichtigste Umsetzungspartner / Partner mit Leistungsverträgen",null,null,null,null,null,null,null,"z.B. Zuständige kantonale Stelle(n) und wichtigste Umsetzungspartner / Partner mit Leistungsverträgen",null,null,null,null,null,null,null,"z.B. Zuständige kantonale Stelle(n) und wichtigste Umsetzungspartner / Partner mit Leistungsverträgen",null,null,null,null,null,null,null,"z.B. Zuständige kantonale Stelle(n) und wichtigste Umsetzungspartner / Partner mit Leistungsverträgen",null,null,null,null,null,null,null,"z.B. Zuständige kantonale Stelle(n) und wichtigste Umsetzungspartner / Partner mit Leistungsverträgen",null,null,null,null,null,null,null,"z.B. Zuständige kantonale Stelle(n) und wichtigste Umsetzungspartner / Partner mit Leistungsverträgen",null,null,null,null,null,null,null,"z.B. Zuständige kantonale Stelle(n) und wichtigste Umsetzungspartner / Partner mit Leistungsverträgen",null,null,null,null,null,null,null,"z.B. Zuständige kantonale Stelle(n) und wichtigste Umsetzungspartner / Partner mit Leistungsverträgen",null,null,null,null,null,null,null,"z.B. Zuständige kantonale Stelle(n) und wichtigste Umsetzungspartner / Partner mit Leistungsverträgen",null,null,null,null,null,null,null,"z.B. Zuständige kantonale Stelle(n) und wichtigste Umsetzungspartner / Partner mit Leistungsverträgen",null,null,null,null,null,null,null,"z.B. Zuständige kantonale Stelle(n) und wichtigste Umsetzungspartner / Partner mit Leistungsverträgen",null,null,null,null,null,null,null,"z.B. Zuständige kantonale Stelle(n) und wichtigste Umsetzungspartner / Partner mit Leistungsverträgen",null,null,null,null,null,null,null,"z.B. Zuständige kantonale Stelle(n) und wichtigste Umsetzungspartner / Partner mit Leistungsverträgen",null,null,null,null,null,null,null,"z.B. Zuständige kantonale Stelle(n) und wichtigste Umsetzungspartner / Partner mit Leistungsverträgen",null,null,null,null,null,null,null,"z.B. Zuständige kantonale Stelle(n) und wichtigste Umsetzungspartner / Partner mit Leistungsverträgen",null,null,null,null,null,null,null,"z.B. Zuständige kantonale Stelle(n) und wichtigste Umsetzungspartner / Partner mit Leistungsverträgen",null,null,null,null,null,null,null,"z.B. Zuständige kantonale Stelle(n) und wichtigste Umsetzungspartner / Partner mit Leistungsverträgen",null,null,null,null,null,null,null,"z.B. Zuständige kantonale Stelle(n) und wichtigste Umsetzungspartner / Partner mit Leistungsverträgen",null,null,null,null,null,null,null,"z.B. Zuständige kantonale Stelle(n) und wichtigste Umsetzungspartner / Partner mit Leistungsverträgen",null,null,null,null,null,null,null,"z.B. Zuständige kantonale Stelle(n) und wichtigste Umsetzungspartner / Partner mit Leistungsverträgen",null,null,null,null,null,null,null,"z.B. Zuständige kantonale Stelle(n) und wichtigste Umsetzungspartner / Partner mit Leistungsverträgen",null,null,null,null,null,null,null,"z.B. Zuständige kantonale Stelle(n) und wichtigste Umsetzungspartner / Partner mit Leistungsverträgen",null,null,null,null,null,null,null,"z.B. Zuständige kantonale Stelle(n) und wichtigste Umsetzungspartner / Partner mit Leistungsverträgen",null,null,null,null,null,null,null,"z.B. Zuständige kantonale Stelle(n) und wichtigste Umsetzungspartner / Partner mit Leistungsverträgen",null,null,null,null,null,null,null,"z.B. Zuständige kantonale Stelle(n) und wichtigste Umsetzungspartner / Partner mit Leistungsverträgen",null,null,null,null,null,null,null,"z.B. Zuständige kantonale Stelle(n) und wichtigste Umsetzungspartner / Partner mit Leistungsverträgen",null,null,null,null,null,null,null,"z.B. Zuständige kantonale Stelle(n) und wichtigste Umsetzungspartner / Partner mit Leistungsverträgen",null,null,null,null,null,null,null,"z.B. Zuständige kantonale Stelle(n) und wichtigste Umsetzungspartner / Partner mit Leistungsverträgen",null,null,null,null,null,null,null,"z.B. Zuständige kantonale Stelle(n) und wichtigste Umsetzungspartner / Partner mit Leistungsverträgen",null,null,null,null,null,null,null,"z.B. Zuständige kantonale Stelle(n) und wichtigste Umsetzungspartner / Partner mit Leistungsverträgen",null,null,null,null,null,null,null,"z.B. Zuständige kantonale Stelle(n) und wichtigste Umsetzungspartner / Partner mit Leistungsverträgen",null,null,null,null,null,null,null,"z.B. Zuständige kantonale Stelle(n) und wichtigste Umsetzungspartner / Partner mit Leistungsverträgen",null,null,null,null,null,null,null,"z.B. Zuständige kantonale Stelle(n) und wichtigste Umsetzungspartner / Partner mit Leistungsverträgen",null,null,null,null,null,null,null,"z.B. Zuständige kantonale Stelle(n) und wichtigste Umsetzungspartner / Partner mit Leistungsverträgen",null,null,null,null,null,null,null,"z.B. Zuständige kantonale Stelle(n) und wichtigste Umsetzungspartner / Partner mit Leistungsverträgen",null,null,null,null,null,null,null,"z.B. Zuständige kantonale Stelle(n) und wichtigste Umsetzungspartner / Partner mit Leistungsverträgen",null,null,null,null,null,null,null,"z.B. Zuständige kantonale Stelle(n) und wichtigste Umsetzungspartner / Partner mit Leistungsverträgen",null,null,null,null,null,null,null,"z.B. Zuständige kantonale Stelle(n) und wichtigste Umsetzungspartner / Partner mit Leistungsverträgen",null,null,null,null,null,null,null,"z.B. Zuständige kantonale Stelle(n) und wichtigste Umsetzungspartner / Partner mit Leistungsverträgen",null,null,null,null,null,null,null,"z.B. Zuständige kantonale Stelle(n) und wichtigste Umsetzungspartner / Partner mit Leistungsverträgen",null,null,null,null,null,null,null,"z.B. Zuständige kantonale Stelle(n) und wichtigste Umsetzungspartner / Partner mit Leistungsverträgen",null,null,null,null,null,null,null,"z.B. Zuständige kantonale Stelle(n) und wichtigste Umsetzungspartner / Partner mit Leistungsverträgen",null,null,null,null,null,null,null,"z.B. Zuständige kantonale Stelle(n) und wichtigste Umsetzungspartner / Partner mit Leistungsverträgen",null,null,null,null,null,null,null,"z.B. Zuständige kantonale Stelle(n) und wichtigste Umsetzungspartner / Partner mit Leistungsverträgen",null,null,null,null,null,null,null,"z.B. Zuständige kantonale Stelle(n) und wichtigste Umsetzungspartner / Partner mit Leistungsverträgen",null,null,null,null,null,null,null,"z.B. Zuständige kantonale Stelle(n) und wichtigste Umsetzungspartner / Partner mit Leistungsverträgen",null,null,null,null,null,null,null,"z.B. Zuständige kantonale Stelle(n) und wichtigste Umsetzungspartner / Partner mit Leistungsverträgen",null,null,null,null,null,null,null,"z.B. Zuständige kantonale Stelle(n) und wichtigste Umsetzungspartner / Partner mit Leistungsverträgen",null,null,null,null,null,null,null,"z.B. Zuständige kantonale Stelle(n) und wichtigste Umsetzungspartner / Partner mit Leistungsverträgen",null,null,null,null,null,null,null,"z.B. Zuständige kantonale Stelle(n) und wichtigste Umsetzungspartner / Partner mit Leistungsverträgen",null,null,null,null,null,null,null,"z.B. Zuständige kantonale Stelle(n) und wichtigste Umsetzungspartner / Partner mit Leistungsverträgen",null,null,null,null,null,null,null,"z.B. Zuständige kantonale Stelle(n) und wichtigste Umsetzungspartner / Partner mit Leistungsverträgen",null,null,null,null,null,null,null,"z.B. Zuständige kantonale Stelle(n) und wichtigste Umsetzungspartner / Partner mit Leistungsverträgen",null,null,null,null,null,null,null,"z.B. Zuständige kantonale Stelle(n) und wichtigste Umsetzungspartner / Partner mit Leistungsverträgen",null,null,null,null,null,null,null,"z.B. Zuständige kantonale Stelle(n) und wichtigste Umsetzungspartner / Partner mit Leistungsverträgen",null,null,null,null,null,null,null,"z.B. Zuständige kantonale Stelle(n) und wichtigste Umsetzungspartner / Partner mit Leistungsverträgen",null,null,null,null,null,null,null,"z.B. Zuständige kantonale Stelle(n) und wichtigste Umsetzungspartner / Partner mit Leistungsverträgen",null,null,null,null,null,null,null,"z.B. Zuständige kantonale Stelle(n) und wichtigste Umsetzungspartner / Partner mit Leistungsverträgen",null,null,null,null,null,null,null,"z.B. Zuständige kantonale Stelle(n) und wichtigste Umsetzungspartner / Partner mit Leistungsverträgen",null,null,null,null,null,null,null,"z.B. Zuständige kantonale Stelle(n) und wichtigste Umsetzungspartner / Partner mit Leistungsverträgen",null,null,null,null,null,null,null,"z.B. Zuständige kantonale Stelle(n) und wichtigste Umsetzungspartner / Partner mit Leistungsverträgen",null,null,null,null,null,null,null,"z.B. Zuständige kantonale Stelle(n) und wichtigste Umsetzungspartner / Partner mit Leistungsverträgen",null,null,null,null,null,null,null,"z.B. Zuständige kantonale Stelle(n) und wichtigste Umsetzungspartner / Partner mit Leistungsverträgen",null,null,null,null,null,null,null,"z.B. Zuständige kantonale Stelle(n) und wichtigste Umsetzungspartner / Partner mit Leistungsverträgen",null,null,null,null,null,null,null,"z.B. Zuständige kantonale Stelle(n) und wichtigste Umsetzungspartner / Partner mit Leistungsverträgen",null,null,null,null,null,null,null,"z.B. Zuständige kantonale Stelle(n) und wichtigste Umsetzungspartner / Partner mit Leistungsverträgen",null,null,null,null,null,null,null,"z.B. Zuständige kantonale Stelle(n) und wichtigste Umsetzungspartner / Partner mit Leistungsverträgen",null,null,null,null,null,null,null,"z.B. Zuständige kantonale Stelle(n) und wichtigste Umsetzungspartner / Partner mit Leistungsverträgen",null,null,null,null,null,null,null,"z.B. Zuständige kantonale Stelle(n) und wichtigste Umsetzungspartner / Partner mit Leistungsverträgen",null,null,null,null,null,null,null,"z.B. Zuständige kantonale Stelle(n) und wichtigste Umsetzungspartner / Partner mit Leistungsverträgen",null,null,null,null,null,null,null,"z.B. Zuständige kantonale Stelle(n) und wichtigste Umsetzungspartner / Partner mit Leistungsverträgen",null,null,null,null,null,null,null,"z.B. Zuständige kantonale Stelle(n) und wichtigste Umsetzungspartner / Partner mit Leistungsverträgen",null,null,null,null,null,null,null,"z.B. Zuständige kantonale Stelle(n) und wichtigste Umsetzungspartner / Partner mit Leistungsverträgen",null,null,null,null,null,null,null,"z.B. Zuständige kantonale Stelle(n) und wichtigste Umsetzungspartner / Partner mit Leistungsverträgen",null,null,null,null,null,null,null,"z.B. Zuständige kantonale Stelle(n) und wichtigste Umsetzungspartner / Partner mit Leistungsverträgen",null,null,null,null,null,null,null,"z.B. Zuständige kantonale Stelle(n) und wichtigste Umsetzungspartner / Partner mit Leistungsverträgen",null,null,null,null,null,null,null,"z.B. Zuständige kantonale Stelle(n) und wichtigste Umsetzungspartner / Partner mit Leistungsverträgen",null,null,null,null,null,null,null,"z.B. Zuständige kantonale Stelle(n) und wichtigste Umsetzungspartner / Partner mit Leistungsverträgen",null,null,null,null,null,null,null,"z.B. Zuständige kantonale Stelle(n) und wichtigste Umsetzungspartner / Partner mit Leistungsverträgen",null,null,null,null,null,null,null,"z.B. Zuständige kantonale Stelle(n) und wichtigste Umsetzungspartner / Partner mit Leistungsverträgen",null,null,null,null,null,null,null,"z.B. Zuständige kantonale Stelle(n) und wichtigste Umsetzungspartner / Partner mit Leistungsverträgen",null,null,null,null,null,null,null,"z.B. Zuständige kantonale Stelle(n) und wichtigste Umsetzungspartner / Partner mit Leistungsverträgen",null,null,null,null,null,null,null,"z.B. Zuständige kantonale Stelle(n) und wichtigste Umsetzungspartner / Partner mit Leistungsverträgen",null,null,null,null,null,null,null,"z.B. Zuständige kantonale Stelle(n) und wichtigste Umsetzungspartner / Partner mit Leistungsverträgen",null,null,null,null,null,null,null,"z.B. Zuständige kantonale Stelle(n) und wichtigste Umsetzungspartner / Partner mit Leistungsverträgen",null,null,null,null,null,null,null,"z.B. Zuständige kantonale Stelle(n) und wichtigste Umsetzungspartner / Partner mit Leistungsverträgen",null,null,null,null,null,null,null,"z.B. Zuständige kantonale Stelle(n) und wichtigste Umsetzungspartner / Partner mit Leistungsverträgen",null,null,null,null,null,null,null,"z.B. Zuständige kantonale Stelle(n) und wichtigste Umsetzungspartner / Partner mit Leistungsverträgen",null,null,null,null,null,null,null,"z.B. Zuständige kantonale Stelle(n) und wichtigste Umsetzungspartner / Partner mit Leistungsverträgen",null,null,null,null,null,null,null,"z.B. Zuständige kantonale Stelle(n) und wichtigste Umsetzungspartner / Partner mit Leistungsverträgen",null,null,null,null,null,null,null,"z.B. Zuständige kantonale Stelle(n) und wichtigste Umsetzungspartner / Partner mit Leistungsverträgen",null,null,null,null,null,null,null,"z.B. Zuständige kantonale Stelle(n) und wichtigste Umsetzungspartner / Partner mit Leistungsverträgen",null,null,null,null,null,null,null,"z.B. Zuständige kantonale Stelle(n) und wichtigste Umsetzungspartner / Partner mit Leistungsverträgen",null,null,null,null,null,null,null,"z.B. Zuständige kantonale Stelle(n) und wichtigste Umsetzungspartner / Partner mit Leistungsverträgen",null,null,null,null,null,null,null,"z.B. Zuständige kantonale Stelle(n) und wichtigste Umsetzungspartner / Partner mit Leistungsverträgen",null,null,null,null,null,null,null,"z.B. Zuständige kantonale Stelle(n) und wichtigste Umsetzungspartner / Partner mit Leistungsverträgen",null,null,null,null,null,null,null,"z.B. Zuständige kantonale Stelle(n) und wichtigste Umsetzungspartner / Partner mit Leistungsverträgen",null,null,null,null,null,null,null,"z.B. Zuständige kantonale Stelle(n) und wichtigste Umsetzungspartner / Partner mit Leistungsverträgen",null,null,null,null,null,null,null,"z.B. Zuständige kantonale Stelle(n) und wichtigste Umsetzungspartner / Partner mit Leistungsverträgen",null,null,null,null,null,null,null,"z.B. Zuständige kantonale Stelle(n) und wichtigste Umsetzungspartner / Partner mit Leistungsverträgen",null,null,null,null,null,null,null,"z.B. Zuständige kantonale Stelle(n) und wichtigste Umsetzungspartner / Partner mit Leistungsverträgen",null,null,null,null,null,null,null,"z.B. Zuständige kantonale Stelle(n) und wichtigste Umsetzungspartner / Partner mit Leistungsverträgen",null,null,null,null,null,null,null,"z.B. Zuständige kantonale Stelle(n) und wichtigste Umsetzungspartner / Partner mit Leistungsverträgen",null,null,null,null,null,null,null,"z.B. Zuständige kantonale Stelle(n) und wichtigste Umsetzungspartner / Partner mit Leistungsverträgen",null,null,null,null,null,null,null,"z.B. Zuständige kantonale Stelle(n) und wichtigste Umsetzungspartner / Partner mit Leistungsverträgen",null,null,null,null,null,null,null,"z.B. Zuständige kantonale Stelle(n) und wichtigste Umsetzungspartner / Partner mit Leistungsverträgen",null,null,null,null,null,null,null,"z.B. Zuständige kantonale Stelle(n) und wichtigste Umsetzungspartner / Partner mit Leistungsverträgen",null,null,null,null,null,null,null,"z.B. Zuständige kantonale Stelle(n) und wichtigste Umsetzungspartner / Partner mit Leistungsverträgen",null,null,null,null,null,null,null,"z.B. Zuständige kantonale Stelle(n) und wichtigste Umsetzungspartner / Partner mit Leistungsverträgen",null,null,null,null,null,null,null,"z.B. Zuständige kantonale Stelle(n) und wichtigste Umsetzungspartner / Partner mit Leistungsverträgen",null,null,null,null,null,null,null,"z.B. Zuständige kantonale Stelle(n) und wichtigste Umsetzungspartner / Partner mit Leistungsverträgen",null,null,null,null,null,null,null,"z.B. Zuständige kantonale Stelle(n) und wichtigste Umsetzungspartner / Partner mit Leistungsverträgen",null,null,null,null,null,null,null,"z.B. Zuständige kantonale Stelle(n) und wichtigste Umsetzungspartner / Partner mit Leistungsverträgen",null,null,null,null,null,null,null,"z.B. Zuständige kantonale Stelle(n) und wichtigste Umsetzungspartner / Partner mit Leistungsverträgen",null,null,null,null,null,null,null,"z.B. Zuständige kantonale Stelle(n) und wichtigste Umsetzungspartner / Partner mit Leistungsverträgen",null,null,null,null,null,null,null,"z.B. Zuständige kantonale Stelle(n) und wichtigste Umsetzungspartner / Partner mit Leistungsverträgen",null,null,null,null,null,null,null,"z.B. Zuständige kantonale Stelle(n) und wichtigste Umsetzungspartner / Partner mit Leistungsverträgen",null,null,null,null,null,null,null,"z.B. Zuständige kantonale Stelle(n) und wichtigste Umsetzungspartner / Partner mit Leistungsverträgen",null,null,null,null,null,null,null,"z.B. Zuständige kantonale Stelle(n) und wichtigste Umsetzungspartner / Partner mit Leistungsverträgen",null,null,null,null,null,null,null,"z.B. Zuständige kantonale Stelle(n) und wichtigste Umsetzungspartner / Partner mit Leistungsverträgen",null,null,null,null,null,null,null,"z.B. Zuständige kantonale Stelle(n) und wichtigste Umsetzungspartner / Partner mit Leistungsverträgen",null,null,null,null,null,null,null,"z.B. Zuständige kantonale Stelle(n) und wichtigste Umsetzungspartner / Partner mit Leistungsverträgen",null,null,null,null,null,null,null,"z.B. Zuständige kantonale Stelle(n) und wichtigste Umsetzungspartner / Partner mit Leistungsverträgen",null,null,null,null,null,null,null,"z.B. Zuständige kantonale Stelle(n) und wichtigste Umsetzungspartner / Partner mit Leistungsverträgen",null,null,null,null,null,null,null,"z.B. Zuständige kantonale Stelle(n) und wichtigste Umsetzungspartner / Partner mit Leistungsverträgen",null,null,null,null,null,null,null,"z.B. Zuständige kantonale Stelle(n) und wichtigste Umsetzungspartner / Partner mit Leistungsverträgen",null,null,null,null,null,null,null,"z.B. Zuständige kantonale Stelle(n) und wichtigste Umsetzungspartner / Partner mit Leistungsverträgen",null,null,null,null,null,null,null,"z.B. Zuständige kantonale Stelle(n) und wichtigste Umsetzungspartner / Partner mit Leistungsverträgen",null,null,null,null,null,null,null,"z.B. Zuständige kantonale Stelle(n) und wichtigste Umsetzungspartner / Partner mit Leistungsverträgen",null,null,null,null,null,null,null,"z.B. Zuständige kantonale Stelle(n) und wichtigste Umsetzungspartner / Partner mit Leistungsverträgen",null,null,null,null,null,null,null,"z.B. Zuständige kantonale Stelle(n) und wichtigste Umsetzungspartner / Partner mit Leistungsverträgen",null,null,null,null,null,null,null,"z.B. Zuständige kantonale Stelle(n) und wichtigste Umsetzungspartner / Partner mit Leistungsverträgen",null,null,null,null,null,null,null,"z.B. Zuständige kantonale Stelle(n) und wichtigste Umsetzungspartner / Partner mit Leistungsverträgen",null,null,null,null,null,null,null,"z.B. Zuständige kantonale Stelle(n) und wichtigste Umsetzungspartner / Partner mit Leistungsverträgen",null,null,null,null,null,null,null,"z.B. Zuständige kantonale Stelle(n) und wichtigste Umsetzungspartner / Partner mit Leistungsverträgen",null,null,null,null,null,null,null,"z.B. Zuständige kantonale Stelle(n) und wichtigste Umsetzungspartner / Partner mit Leistungsverträgen",null,null,null,null,null,null,null,"z.B. Zuständige kantonale Stelle(n) und wichtigste Umsetzungspartner / Partner mit Leistungsverträgen",null,null,null,null,null,null,null,"z.B. Zuständige kantonale Stelle(n) und wichtigste Umsetzungspartner / Partner mit Leistungsverträgen",null,null,null,null,null,null,null,"z.B. Zuständige kantonale Stelle(n) und wichtigste Umsetzungspartner / Partner mit Leistungsverträgen",null,null,null,null,null,null,null,"z.B. Zuständige kantonale Stelle(n) und wichtigste Umsetzungspartner / Partner mit Leistungsverträgen",null,null,null,null,null,null,null,"z.B. Zuständige kantonale Stelle(n) und wichtigste Umsetzungspartner / Partner mit Leistungsverträgen",null,null,null,null,null,null,null,"z.B. Zuständige kantonale Stelle(n) und wichtigste Umsetzungspartner / Partner mit Leistungsverträgen",null,null,null,null,null,null,null,"z.B. Zuständige kantonale Stelle(n) und wichtigste Umsetzungspartner / Partner mit Leistungsverträgen",null,null,null,null,null,null,null,"z.B. Zuständige kantonale Stelle(n) und wichtigste Umsetzungspartner / Partner mit Leistungsverträgen",null,null,null,null,null,null,null,"z.B. Zuständige kantonale Stelle(n) und wichtigste Umsetzungspartner / Partner mit Leistungsverträgen",null,null,null,null,null,null,null,"z.B. Zuständige kantonale Stelle(n) und wichtigste Umsetzungspartner / Partner mit Leistungsverträgen",null,null,null,null,null,null,null,"z.B. Zuständige kantonale Stelle(n) und wichtigste Umsetzungspartner / Partner mit Leistungsverträgen",null,null,null,null,null,null,null,"z.B. Zuständige kantonale Stelle(n) und wichtigste Umsetzungspartner / Partner mit Leistungsverträgen",null,null,null,null,null,null,null,"z.B. Zuständige kantonale Stelle(n) und wichtigste Umsetzungspartner / Partner mit Leistungsverträgen",null,null,null,null,null,null,null,"z.B. Zuständige kantonale Stelle(n) und wichtigste Umsetzungspartner / Partner mit Leistungsverträgen",null,null,null,null,null,null,null,"z.B. Zuständige kantonale Stelle(n) und wichtigste Umsetzungspartner / Partner mit Leistungsverträgen",null,null,null,null,null,null,null,"z.B. Zuständige kantonale Stelle(n) und wichtigste Umsetzungspartner / Partner mit Leistungsverträgen",null,null,null,null,null,null,null,"z.B. Zuständige kantonale Stelle(n) und wichtigste Umsetzungspartner / Partner mit Leistungsverträgen",null,null,null,null,null,null,null,"z.B. Zuständige kantonale Stelle(n) und wichtigste Umsetzungspartner / Partner mit Leistungsverträgen",null,null,null,null,null,null,null,"z.B. Zuständige kantonale Stelle(n) und wichtigste Umsetzungspartner / Partner mit Leistungsverträgen",null,null,null,null,null,null,null,"z.B. Zuständige kantonale Stelle(n) und wichtigste Umsetzungspartner / Partner mit Leistungsverträgen",null,null,null,null,null,null,null,"z.B. Zuständige kantonale Stelle(n) und wichtigste Umsetzungspartner / Partner mit Leistungsverträgen",null,null,null,null,null,null,null,"z.B. Zuständige kantonale Stelle(n) und wichtigste Umsetzungspartner / Partner mit Leistungsverträgen",null,null,null,null,null,null,null,"z.B. Zuständige kantonale Stelle(n) und wichtigste Umsetzungspartner / Partner mit Leistungsverträgen",null,null,null,null,null,null,null,"z.B. Zuständige kantonale Stelle(n) und wichtigste Umsetzungspartner / Partner mit Leistungsverträgen",null,null,null,null,null,null,null,"z.B. Zuständige kantonale Stelle(n) und wichtigste Umsetzungspartner / Partner mit Leistungsverträgen",null,null,null,null,null,null,null,"z.B. Zuständige kantonale Stelle(n) und wichtigste Umsetzungspartner / Partner mit Leistungsverträgen",null,null,null,null,null,null,null,"z.B. Zuständige kantonale Stelle(n) und wichtigste Umsetzungspartner / Partner mit Leistungsverträgen",null,null,null,null,null,null,null,"z.B. Zuständige kantonale Stelle(n) und wichtigste Umsetzungspartner / Partner mit Leistungsverträgen",null,null,null,null,null,null,null,"z.B. Zuständige kantonale Stelle(n) und wichtigste Umsetzungspartner / Partner mit Leistungsverträgen",null,null,null,null,null,null,null,"z.B. Zuständige kantonale Stelle(n) und wichtigste Umsetzungspartner / Partner mit Leistungsverträgen",null,null,null,null,null,null,null,"z.B. Zuständige kantonale Stelle(n) und wichtigste Umsetzungspartner / Partner mit Leistungsverträgen",null,null,null,null,null,null,null,"z.B. Zuständige kantonale Stelle(n) und wichtigste Umsetzungspartner / Partner mit Leistungsverträgen",null,null,null,null,null,null,null,"z.B. Zuständige kantonale Stelle(n) und wichtigste Umsetzungspartner / Partner mit Leistungsverträgen",null,null,null,null,null,null,null,"z.B. Zuständige kantonale Stelle(n) und wichtigste Umsetzungspartner / Partner mit Leistungsverträgen",null,null,null,null,null,null,null,"z.B. Zuständige kantonale Stelle(n) und wichtigste Umsetzungspartner / Partner mit Leistungsverträgen",null,null,null,null,null,null,null,"z.B. Zuständige kantonale Stelle(n) und wichtigste Umsetzungspartner / Partner mit Leistungsverträgen",null,null,null,null,null,null,null,"z.B. Zuständige kantonale Stelle(n) und wichtigste Umsetzungspartner / Partner mit Leistungsverträgen",null,null,null,null,null,null,null,"z.B. Zuständige kantonale Stelle(n) und wichtigste Umsetzungspartner / Partner mit Leistungsverträgen",null,null,null,null,null,null,null,"z.B. Zuständige kantonale Stelle(n) und wichtigste Umsetzungspartner / Partner mit Leistungsverträgen",null,null,null,null,null,null,null,"z.B. Zuständige kantonale Stelle(n) und wichtigste Umsetzungspartner / Partner mit Leistungsverträgen",null,null,null,null,null,null,null,"z.B. Zuständige kantonale Stelle(n) und wichtigste Umsetzungspartner / Partner mit Leistungsverträgen",null,null,null,null,null,null,null,"z.B. Zuständige kantonale Stelle(n) und wichtigste Umsetzungspartner / Partner mit Leistungsverträgen",null,null,null,null,null,null,null,"z.B. Zuständige kantonale Stelle(n) und wichtigste Umsetzungspartner / Partner mit Leistungsverträgen",null,null,null,null,null,null,null,"z.B. Zuständige kantonale Stelle(n) und wichtigste Umsetzungspartner / Partner mit Leistungsverträgen",null,null,null,null,null,null,null,"z.B. Zuständige kantonale Stelle(n) und wichtigste Umsetzungspartner / Partner mit Leistungsverträgen",null,null,null,null,null,null,null,"z.B. Zuständige kantonale Stelle(n) und wichtigste Umsetzungspartner / Partner mit Leistungsverträgen",null,null,null,null,null,null,null,"z.B. Zuständige kantonale Stelle(n) und wichtigste Umsetzungspartner / Partner mit Leistungsverträgen",null,null,null,null,null,null,null,"z.B. Zuständige kantonale Stelle(n) und wichtigste Umsetzungspartner / Partner mit Leistungsverträgen",null,null,null,null,null,null,null,"z.B. Zuständige kantonale Stelle(n) und wichtigste Umsetzungspartner / Partner mit Leistungsverträgen",null,null,null,null,null,null,null,"z.B. Zuständige kantonale Stelle(n) und wichtigste Umsetzungspartner / Partner mit Leistungsverträgen",null,null,null,null,null,null,null,"z.B. Zuständige kantonale Stelle(n) und wichtigste Umsetzungspartner / Partner mit Leistungsverträgen",null,null,null,null,null,null,null,"z.B. Zuständige kantonale Stelle(n) und wichtigste Umsetzungspartner / Partner mit Leistungsverträgen",null,null,null,null,null,null,null,"z.B. Zuständige kantonale Stelle(n) und wichtigste Umsetzungspartner / Partner mit Leistungsverträgen",null,null,null,null,null,null,null,"z.B. Zuständige kantonale Stelle(n) und wichtigste Umsetzungspartner / Partner mit Leistungsverträgen",null,null,null,null,null,null,null,"z.B. Zuständige kantonale Stelle(n) und wichtigste Umsetzungspartner / Partner mit Leistungsverträgen",null,null,null,null,null,null,null,"z.B. Zuständige kantonale Stelle(n) und wichtigste Umsetzungspartner / Partner mit Leistungsverträgen",null,null,null,null,null,null,null,"z.B. Zuständige kantonale Stelle(n) und wichtigste Umsetzungspartner / Partner mit Leistungsverträgen",null,null,null,null,null,null,null,"z.B. Zuständige kantonale Stelle(n) und wichtigste Umsetzungspartner / Partner mit Leistungsverträgen",null,null,null,null,null,null,null,"z.B. Zuständige kantonale Stelle(n) und wichtigste Umsetzungspartner / Partner mit Leistungsverträgen",null,null,null,null,null,null,null,"z.B. Zuständige kantonale Stelle(n) und wichtigste Umsetzungspartner / Partner mit Leistungsverträgen",null,null,null,null,null,null,null,"z.B. Zuständige kantonale Stelle(n) und wichtigste Umsetzungspartner / Partner mit Leistungsverträgen",null,null,null,null,null,null,null,"z.B. Zuständige kantonale Stelle(n) und wichtigste Umsetzungspartner / Partner mit Leistungsverträgen",null,null,null,null,null,null,null,"z.B. Zuständige kantonale Stelle(n) und wichtigste Umsetzungspartner / Partner mit Leistungsverträgen",null,null,null,null,null,null,null,"z.B. Zuständige kantonale Stelle(n) und wichtigste Umsetzungspartner / Partner mit Leistungsverträgen",null,null,null,null,null,null,null,"z.B. Zuständige kantonale Stelle(n) und wichtigste Umsetzungspartner / Partner mit Leistungsverträgen",null,null,null,null,null,null,null,"z.B. Zuständige kantonale Stelle(n) und wichtigste Umsetzungspartner / Partner mit Leistungsverträgen",null,null,null,null,null,null,null,"z.B. Zuständige kantonale Stelle(n) und wichtigste Umsetzungspartner / Partner mit Leistungsverträgen",null,null,null,null,null,null,null,"z.B. Zuständige kantonale Stelle(n) und wichtigste Umsetzungspartner / Partner mit Leistungsverträgen",null,null,null,null,null,null,null,"z.B. Zuständige kantonale Stelle(n) und wichtigste Umsetzungspartner / Partner mit Leistungsverträgen",null,null,null,null,null,null,null,"z.B. Zuständige kantonale Stelle(n) und wichtigste Umsetzungspartner / Partner mit Leistungsverträgen",null,null,null,null,null,null,null,"z.B. Zuständige kantonale Stelle(n) und wichtigste Umsetzungspartner / Partner mit Leistungsverträgen",null,null,null,null,null,null,null,"z.B. Zuständige kantonale Stelle(n) und wichtigste Umsetzungspartner / Partner mit Leistungsverträgen",null,null,null,null,null,null,null,"z.B. Zuständige kantonale Stelle(n) und wichtigste Umsetzungspartner / Partner mit Leistungsverträgen",null,null,null,null,null,null,null,"z.B. Zuständige kantonale Stelle(n) und wichtigste Umsetzungspartner / Partner mit Leistungsverträgen",null,null,null,null,null,null,null,"z.B. Zuständige kantonale Stelle(n) und wichtigste Umsetzungspartner / Partner mit Leistungsverträgen",null,null,null,null,null,null,null,"z.B. Zuständige kantonale Stelle(n) und wichtigste Umsetzungspartner / Partner mit Leistungsverträgen",null,null,null,null,null,null,null,"z.B. Zuständige kantonale Stelle(n) und wichtigste Umsetzungspartner / Partner mit Leistungsverträgen",null,null,null,null,null,null,null,"z.B. Zuständige kantonale Stelle(n) und wichtigste Umsetzungspartner / Partner mit Leistungsverträgen",null,null,null,null,null,null,null,"z.B. Zuständige kantonale Stelle(n) und wichtigste Umsetzungspartner / Partner mit Leistungsverträgen",null,null,null,null,null,null,null,"z.B. Zuständige kantonale Stelle(n) und wichtigste Umsetzungspartner / Partner mit Leistungsverträgen",null,null,null,null,null,null,null,"z.B. Zuständige kantonale Stelle(n) und wichtigste Umsetzungspartner / Partner mit Leistungsverträgen",null,null,null,null,null,null,null,"z.B. Zuständige kantonale Stelle(n) und wichtigste Umsetzungspartner / Partner mit Leistungsverträgen",null,null,null,null,null,null,null,"z.B. Zuständige kantonale Stelle(n) und wichtigste Umsetzungspartner / Partner mit Leistungsverträgen",null,null,null,null,null,null,null,"z.B. Zuständige kantonale Stelle(n) und wichtigste Umsetzungspartner / Partner mit Leistungsverträgen",null,null,null,null,null,null,null,"z.B. Zuständige kantonale Stelle(n) und wichtigste Umsetzungspartner / Partner mit Leistungsverträgen",null,null,null,null,null,null,null,"z.B. Zuständige kantonale Stelle(n) und wichtigste Umsetzungspartner / Partner mit Leistungsverträgen",null,null,null,null,null,null,null,"z.B. Zuständige kantonale Stelle(n) und wichtigste Umsetzungspartner / Partner mit Leistungsverträgen",null,null,null,null,null,null,null,"z.B. Zuständige kantonale Stelle(n) und wichtigste Umsetzungspartner / Partner mit Leistungsverträgen",null,null,null,null,null,null,null,"z.B. Zuständige kantonale Stelle(n) und wichtigste Umsetzungspartner / Partner mit Leistungsverträgen",null,null,null,null,null,null,null,"z.B. Zuständige kantonale Stelle(n) und wichtigste Umsetzungspartner / Partner mit Leistungsverträgen",null,null,null,null,null,null,null,"z.B. Zuständige kantonale Stelle(n) und wichtigste Umsetzungspartner / Partner mit Leistungsverträgen",null,null,null,null,null,null,null,"z.B. Zuständige kantonale Stelle(n) und wichtigste Umsetzungspartner / Partner mit Leistungsverträgen",null,null,null,null,null,null,null,"z.B. Zuständige kantonale Stelle(n) und wichtigste Umsetzungspartner / Partner mit Leistungsverträgen",null,null,null,null,null,null,null,"z.B. Zuständige kantonale Stelle(n) und wichtigste Umsetzungspartner / Partner mit Leistungsverträgen",null,null,null,null,null,null,null,"z.B. Zuständige kantonale Stelle(n) und wichtigste Umsetzungspartner / Partner mit Leistungsverträgen",null,null,null,null,null,null,null,"z.B. Zuständige kantonale Stelle(n) und wichtigste Umsetzungspartner / Partner mit Leistungsverträgen",null,null,null,null,null,null,null,"z.B. Zuständige kantonale Stelle(n) und wichtigste Umsetzungspartner / Partner mit Leistungsverträgen",null,null,null,null,null,null,null,"z.B. Zuständige kantonale Stelle(n) und wichtigste Umsetzungspartner / Partner mit Leistungsverträgen",null,null,null,null,null,null,null,"z.B. Zuständige kantonale Stelle(n) und wichtigste Umsetzungspartner / Partner mit Leistungsverträgen",null,null,null,null,null,null,null,"z.B. Zuständige kantonale Stelle(n) und wichtigste Umsetzungspartner / Partner mit Leistungsverträgen",null,null,null,null,null,null,null,"z.B. Zuständige kantonale Stelle(n) und wichtigste Umsetzungspartner / Partner mit Leistungsverträgen",null,null,null,null,null,null,null,"z.B. Zuständige kantonale Stelle(n) und wichtigste Umsetzungspartner / Partner mit Leistungsverträgen",null,null,null,null,null,null,null,"z.B. Zuständige kantonale Stelle(n) und wichtigste Umsetzungspartner / Partner mit Leistungsverträgen",null,null,null,null,null,null,null,"z.B. Zuständige kantonale Stelle(n) und wichtigste Umsetzungspartner / Partner mit Leistungsverträgen",null,null,null,null,null,null,null,"z.B. Zuständige kantonale Stelle(n) und wichtigste Umsetzungspartner / Partner mit Leistungsverträgen",null,null,null,null,null,null,null,"z.B. Zuständige kantonale Stelle(n) und wichtigste Umsetzungspartner / Partner mit Leistungsverträgen",null,null,null,null,null,null,null,"z.B. Zuständige kantonale Stelle(n) und wichtigste Umsetzungspartner / Partner mit Leistungsverträgen",null,null,null,null,null,null,null,"z.B. Zuständige kantonale Stelle(n) und wichtigste Umsetzungspartner / Partner mit Leistungsverträgen",null,null,null,null,null,null,null,"z.B. Zuständige kantonale Stelle(n) und wichtigste Umsetzungspartner / Partner mit Leistungsverträgen",null,null,null,null,null,null,null,"z.B. Zuständige kantonale Stelle(n) und wichtigste Umsetzungspartner / Partner mit Leistungsverträgen",null,null,null,null,null,null,null,"z.B. Zuständige kantonale Stelle(n) und wichtigste Umsetzungspartner / Partner mit Leistungsverträgen",null,null,null,null,null,null,null,"z.B. Zuständige kantonale Stelle(n) und wichtigste Umsetzungspartner / Partner mit Leistungsverträgen",null,null,null,null,null,null,null,"z.B. Zuständige kantonale Stelle(n) und wichtigste Umsetzungspartner / Partner mit Leistungsverträgen",null,null,null,null,null,null,null,"z.B. Zuständige kantonale Stelle(n) und wichtigste Umsetzungspartner / Partner mit Leistungsverträgen",null,null,null,null,null,null,null,"z.B. Zuständige kantonale Stelle(n) und wichtigste Umsetzungspartner / Partner mit Leistungsverträgen",null,null,null,null,null,null,null,"z.B. Zuständige kantonale Stelle(n) und wichtigste Umsetzungspartner / Partner mit Leistungsverträgen",null,null,null,null,null,null,null,"z.B. Zuständige kantonale Stelle(n) und wichtigste Umsetzungspartner / Partner mit Leistungsverträgen",null,null,null,null,null,null,null,"z.B. Zuständige kantonale Stelle(n) und wichtigste Umsetzungspartner / Partner mit Leistungsverträgen",null,null,null,null,null,null,null,"z.B. Zuständige kantonale Stelle(n) und wichtigste Umsetzungspartner / Partner mit Leistungsverträgen",null,null,null,null,null,null,null,"z.B. Zuständige kantonale Stelle(n) und wichtigste Umsetzungspartner / Partner mit Leistungsverträgen",null,null,null,null,null,null,null,"z.B. Zuständige kantonale Stelle(n) und wichtigste Umsetzungspartner / Partner mit Leistungsverträgen",null,null,null,null,null,null,null,"z.B. Zuständige kantonale Stelle(n) und wichtigste Umsetzungspartner / Partner mit Leistungsverträgen",null,null,null,null,null,null,null,"z.B. Zuständige kantonale Stelle(n) und wichtigste Umsetzungspartner / Partner mit Leistungsverträgen",null,null,null,null,null,null,null,"z.B. Zuständige kantonale Stelle(n) und wichtigste Umsetzungspartner / Partner mit Leistungsverträgen",null,null,null,null,null,null,null,"z.B. Zuständige kantonale Stelle(n) und wichtigste Umsetzungspartner / Partner mit Leistungsverträgen",null,null,null,null,null,null,null,"z.B. Zuständige kantonale Stelle(n) und wichtigste Umsetzungspartner / Partner mit Leistungsverträgen",null,null,null,null,null,null,null,"z.B. Zuständige kantonale Stelle(n) und wichtigste Umsetzungspartner / Partner mit Leistungsverträgen",null,null,null,null,null,null,null,"z.B. Zuständige kantonale Stelle(n) und wichtigste Umsetzungspartner / Partner mit Leistungsverträgen",null,null,null,null,null,null,null,"z.B. Zuständige kantonale Stelle(n) und wichtigste Umsetzungspartner / Partner mit Leistungsverträgen",null,null,null,null,null,null,null,"z.B. Zuständige kantonale Stelle(n) und wichtigste Umsetzungspartner / Partner mit Leistungsverträgen",null,null,null,null,null,null,null,"z.B. Zuständige kantonale Stelle(n) und wichtigste Umsetzungspartner / Partner mit Leistungsverträgen",null,null,null,null,null,null,null,"z.B. Zuständige kantonale Stelle(n) und wichtigste Umsetzungspartner / Partner mit Leistungsverträgen",null,null,null,null,null,null,null,"z.B. Zuständige kantonale Stelle(n) und wichtigste Umsetzungspartner / Partner mit Leistungsverträgen",null,null,null,null,null,null,null,"z.B. Zuständige kantonale Stelle(n) und wichtigste Umsetzungspartner / Partner mit Leistungsverträgen",null,null,null,null,null,null,null,"z.B. Zuständige kantonale Stelle(n) und wichtigste Umsetzungspartner / Partner mit Leistungsverträgen",null,null,null,null,null,null,null,"z.B. Zuständige kantonale Stelle(n) und wichtigste Umsetzungspartner / Partner mit Leistungsverträgen",null,null,null,null,null,null,null,"z.B. Zuständige kantonale Stelle(n) und wichtigste Umsetzungspartner / Partner mit Leistungsverträgen",null,null,null,null,null,null,null,"z.B. Zuständige kantonale Stelle(n) und wichtigste Umsetzungspartner / Partner mit Leistungsverträgen",null,null,null,null,null,null,null,"z.B. Zuständige kantonale Stelle(n) und wichtigste Umsetzungspartner / Partner mit Leistungsverträgen",null,null,null,null,null,null,null,"z.B. Zuständige kantonale Stelle(n) und wichtigste Umsetzungspartner / Partner mit Leistungsverträgen",null,null,null,null,null,null,null,"z.B. Zuständige kantonale Stelle(n) und wichtigste Umsetzungspartner / Partner mit Leistungsverträgen",null,null,null,null,null,null,null,"z.B. Zuständige kantonale Stelle(n) und wichtigste Umsetzungspartner / Partner mit Leistungsverträgen",null,null,null,null,null,null,null,"z.B. Zuständige kantonale Stelle(n) und wichtigste Umsetzungspartner / Partner mit Leistungsverträgen",null,null,null,null,null,null,null,"z.B. Zuständige kantonale Stelle(n) und wichtigste Umsetzungspartner / Partner mit Leistungsverträgen",null,null,null,null,null,null,null,"z.B. Zuständige kantonale Stelle(n) und wichtigste Umsetzungspartner / Partner mit Leistungsverträgen",null,null,null,null,null,null,null,"z.B. Zuständige kantonale Stelle(n) und wichtigste Umsetzungspartner / Partner mit Leistungsverträgen",null,null,null,null,null,null,null,"z.B. Zuständige kantonale Stelle(n) und wichtigste Umsetzungspartner / Partner mit Leistungsverträgen",null,null,null,null,null,null,null,"z.B. Zuständige kantonale Stelle(n) und wichtigste Umsetzungspartner / Partner mit Leistungsverträgen",null,null,null,null,null,null,null,"z.B. Zuständige kantonale Stelle(n) und wichtigste Umsetzungspartner / Partner mit Leistungsverträgen",null,null,null,null,null,null,null,"z.B. Zuständige kantonale Stelle(n) und wichtigste Umsetzungspartner / Partner mit Leistungsverträgen",null,null,null,null,null,null,null,"z.B. Zuständige kantonale Stelle(n) und wichtigste Umsetzungspartner / Partner mit Leistungsverträgen",null,null,null,null,null,null,null,"z.B. Zuständige kantonale Stelle(n) und wichtigste Umsetzungspartner / Partner mit Leistungsverträgen",null,null,null,null,null,null,null,"z.B. Zuständige kantonale Stelle(n) und wichtigste Umsetzungspartner / Partner mit Leistungsverträgen",null,null,null,null,null,null,null,"z.B. Zuständige kantonale Stelle(n) und wichtigste Umsetzungspartner / Partner mit Leistungsverträgen",null,null,null,null,null,null,null,"z.B. Zuständige kantonale Stelle(n) und wichtigste Umsetzungspartner / Partner mit Leistungsverträgen",null,null,null,null,null,null,null,"z.B. Zuständige kantonale Stelle(n) und wichtigste Umsetzungspartner / Partner mit Leistungsverträgen",null,null,null,null,null,null,null,"z.B. Zuständige kantonale Stelle(n) und wichtigste Umsetzungspartner / Partner mit Leistungsverträgen",null,null,null,null,null,null,null,"z.B. Zuständige kantonale Stelle(n) und wichtigste Umsetzungspartner / Partner mit Leistungsverträgen",null,null,null,null,null,null,null,"z.B. Zuständige kantonale Stelle(n) und wichtigste Umsetzungspartner / Partner mit Leistungsverträgen",null,null,null,null,null,null,null,"z.B. Zuständige kantonale Stelle(n) und wichtigste Umsetzungspartner / Partner mit Leistungsverträgen",null,null,null,null,null,null,null,"z.B. Zuständige kantonale Stelle(n) und wichtigste Umsetzungspartner / Partner mit Leistungsverträgen",null,null,null,null,null,null,null,"z.B. Zuständige kantonale Stelle(n) und wichtigste Umsetzungspartner / Partner mit Leistungsverträgen",null,null,null,null,null,null,null,"z.B. Zuständige kantonale Stelle(n) und wichtigste Umsetzungspartner / Partner mit Leistungsverträgen",null,null,null,null,null,null,null,"z.B. Zuständige kantonale Stelle(n) und wichtigste Umsetzungspartner / Partner mit Leistungsverträgen",null,null,null,null,null,null,null,"z.B. Zuständige kantonale Stelle(n) und wichtigste Umsetzungspartner / Partner mit Leistungsverträgen",null,null,null,null,null,null,null,"z.B. Zuständige kantonale Stelle(n) und wichtigste Umsetzungspartner / Partner mit Leistungsverträgen",null,null,null,null,null,null,null,"z.B. Zuständige kantonale Stelle(n) und wichtigste Umsetzungspartner / Partner mit Leistungsverträgen",null,null,null,null,null,null,null,"z.B. Zuständige kantonale Stelle(n) und wichtigste Umsetzungspartner / Partner mit Leistungsverträgen",null,null,null,null,null,null,null,"z.B. Zuständige kantonale Stelle(n) und wichtigste Umsetzungspartner / Partner mit Leistungsverträgen",null,null,null,null,null,null,null,"z.B. Zuständige kantonale Stelle(n) und wichtigste Umsetzungspartner / Partner mit Leistungsverträgen",null,null,null,null,null,null,null,"z.B. Zuständige kantonale Stelle(n) und wichtigste Umsetzungspartner / Partner mit Leistungsverträgen",null,null,null,null,null,null,null,"z.B. Zuständige kantonale Stelle(n) und wichtigste Umsetzungspartner / Partner mit Leistungsverträgen",null,null,null,null,null,null,null,"z.B. Zuständige kantonale Stelle(n) und wichtigste Umsetzungspartner / Partner mit Leistungsverträgen",null,null,null,null,null,null,null,"z.B. Zuständige kantonale Stelle(n) und wichtigste Umsetzungspartner / Partner mit Leistungsverträgen",null,null,null,null,null,null,null,"z.B. Zuständige kantonale Stelle(n) und wichtigste Umsetzungspartner / Partner mit Leistungsverträgen",null,null,null,null,null,null,null,"z.B. Zuständige kantonale Stelle(n) und wichtigste Umsetzungspartner / Partner mit Leistungsverträgen",null,null,null,null,null,null,null,"z.B. Zuständige kantonale Stelle(n) und wichtigste Umsetzungspartner / Partner mit Leistungsverträgen",null,null,null,null,null,null,null,"z.B. Zuständige kantonale Stelle(n) und wichtigste Umsetzungspartner / Partner mit Leistungsverträgen",null,null,null,null,null,null,null,"z.B. Zuständige kantonale Stelle(n) und wichtigste Umsetzungspartner / Partner mit Leistungsverträgen",null,null,null,null,null,null,null,"z.B. Zuständige kantonale Stelle(n) und wichtigste Umsetzungspartner / Partner mit Leistungsverträgen",null,null,null,null,null,null,null,"z.B. Zuständige kantonale Stelle(n) und wichtigste Umsetzungspartner / Partner mit Leistungsverträgen",null,null,null,null,null,null,null,"z.B. Zuständige kantonale Stelle(n) und wichtigste Umsetzungspartner / Partner mit Leistungsverträgen",null,null,null,null,null,null,null,"z.B. Zuständige kantonale Stelle(n) und wichtigste Umsetzungspartner / Partner mit Leistungsverträgen",null,null,null,null,null,null,null,"z.B. Zuständige kantonale Stelle(n) und wichtigste Umsetzungspartner / Partner mit Leistungsverträgen",null,null,null,null,null,null,null,"z.B. Zuständige kantonale Stelle(n) und wichtigste Umsetzungspartner / Partner mit Leistungsverträgen",null,null,null,null,null,null,null,"z.B. Zuständige kantonale Stelle(n) und wichtigste Umsetzungspartner / Partner mit Leistungsverträgen",null,null,null,null,null,null,null,"z.B. Zuständige kantonale Stelle(n) und wichtigste Umsetzungspartner / Partner mit Leistungsverträgen",null,null,null,null,null,null,null,"z.B. Zuständige kantonale Stelle(n) und wichtigste Umsetzungspartner / Partner mit Leistungsverträgen",null,null,null,null,null,null,null,"z.B. Zuständige kantonale Stelle(n) und wichtigste Umsetzungspartner / Partner mit Leistungsverträgen",null,null,null,null,null,null,null,"z.B. Zuständige kantonale Stelle(n) und wichtigste Umsetzungspartner / Partner mit Leistungsverträgen",null,null,null,null,null,null,null,"z.B. Zuständige kantonale Stelle(n) und wichtigste Umsetzungspartner / Partner mit Leistungsverträgen",null,null,null,null,null,null,null,"z.B. Zuständige kantonale Stelle(n) und wichtigste Umsetzungspartner / Partner mit Leistungsverträgen",null,null,null,null,null,null,null,"z.B. Zuständige kantonale Stelle(n) und wichtigste Umsetzungspartner / Partner mit Leistungsverträgen",null,null,null,null,null,null,null,"z.B. Zuständige kantonale Stelle(n) und wichtigste Umsetzungspartner / Partner mit Leistungsverträgen",null,null,null,null,null,null,null,"z.B. Zuständige kantonale Stelle(n) und wichtigste Umsetzungspartner / Partner mit Leistungsverträgen",null,null,null,null,null,null,null,"z.B. Zuständige kantonale Stelle(n) und wichtigste Umsetzungspartner / Partner mit Leistungsverträgen",null,null,null,null,null,null,null,"z.B. Zuständige kantonale Stelle(n) und wichtigste Umsetzungspartner / Partner mit Leistungsverträgen",null,null,null,null,null,null,null,"z.B. Zuständige kantonale Stelle(n) und wichtigste Umsetzungspartner / Partner mit Leistungsverträgen",null,null,null,null,null,null,null,"z.B. Zuständige kantonale Stelle(n) und wichtigste Umsetzungspartner / Partner mit Leistungsverträgen",null,null,null,null,null,null,null,"z.B. Zuständige kantonale Stelle(n) und wichtigste Umsetzungspartner / Partner mit Leistungsverträgen",null,null,null,null,null,null,null,"z.B. Zuständige kantonale Stelle(n) und wichtigste Umsetzungspartner / Partner mit Leistungsverträgen",null,null,null,null,null,null,null,"z.B. Zuständige kantonale Stelle(n) und wichtigste Umsetzungspartner / Partner mit Leistungsverträgen",null,null,null,null,null,null,null,"z.B. Zuständige kantonale Stelle(n) und wichtigste Umsetzungspartner / Partner mit Leistungsverträgen",null,null,null,null,null,null,null,"z.B. Zuständige kantonale Stelle(n) und wichtigste Umsetzungspartner / Partner mit Leistungsverträgen",null,null,null,null,null,null,null,"z.B. Zuständige kantonale Stelle(n) und wichtigste Umsetzungspartner / Partner mit Leistungsverträgen",null,null,null,null,null,null,null,"z.B. Zuständige kantonale Stelle(n) und wichtigste Umsetzungspartner / Partner mit Leistungsverträgen",null,null,null,null,null,null,null,"z.B. Zuständige kantonale Stelle(n) und wichtigste Umsetzungspartner / Partner mit Leistungsverträgen",null,null,null,null,null,null,null,"z.B. Zuständige kantonale Stelle(n) und wichtigste Umsetzungspartner / Partner mit Leistungsverträgen",null,null,null,null,null,null,null,"z.B. Zuständige kantonale Stelle(n) und wichtigste Umsetzungspartner / Partner mit Leistungsverträgen",null,null,null,null,null,null,null,"z.B. Zuständige kantonale Stelle(n) und wichtigste Umsetzungspartner / Partner mit Leistungsverträgen",null,null,null,null,null,null,null,"z.B. Zuständige kantonale Stelle(n) und wichtigste Umsetzungspartner / Partner mit Leistungsverträgen",null,null,null,null,null,null,null,"z.B. Zuständige kantonale Stelle(n) und wichtigste Umsetzungspartner / Partner mit Leistungsverträgen",null,null,null,null,null,null,null,"z.B. Zuständige kantonale Stelle(n) und wichtigste Umsetzungspartner / Partner mit Leistungsverträgen",null,null,null,null,null,null,null,"z.B. Zuständige kantonale Stelle(n) und wichtigste Umsetzungspartner / Partner mit Leistungsverträgen",null,null,null,null,null,null,null,"z.B. Zuständige kantonale Stelle(n) und wichtigste Umsetzungspartner / Partner mit Leistungsverträgen",null,null,null,null,null,null,null,"z.B. Zuständige kantonale Stelle(n) und wichtigste Umsetzungspartner / Partner mit Leistungsverträgen",null,null,null,null,null,null,null,"z.B. Zuständige kantonale Stelle(n) und wichtigste Umsetzungspartner / Partner mit Leistungsverträgen",null,null,null,null,null,null,null,"z.B. Zuständige kantonale Stelle(n) und wichtigste Umsetzungspartner / Partner mit Leistungsverträgen",null,null,null,null,null,null,null,"z.B. Zuständige kantonale Stelle(n) und wichtigste Umsetzungspartner / Partner mit Leistungsverträgen",null,null,null,null,null,null,null,"z.B. Zuständige kantonale Stelle(n) und wichtigste Umsetzungspartner / Partner mit Leistungsverträgen",null,null,null,null,null,null,null,"z.B. Zuständige kantonale Stelle(n) und wichtigste Umsetzungspartner / Partner mit Leistungsverträgen",null,null,null,null,null,null,null,"z.B. Zuständige kantonale Stelle(n) und wichtigste Umsetzungspartner / Partner mit Leistungsverträgen",null,null,null,null,null,null,null,"z.B. Zuständige kantonale Stelle(n) und wichtigste Umsetzungspartner / Partner mit Leistungsverträgen",null,null,null,null,null,null,null,"z.B. Zuständige kantonale Stelle(n) und wichtigste Umsetzungspartner / Partner mit Leistungsverträgen",null,null,null,null,null,null,null,"z.B. Zuständige kantonale Stelle(n) und wichtigste Umsetzungspartner / Partner mit Leistungsverträgen",null,null,null,null,null,null,null,"z.B. Zuständige kantonale Stelle(n) und wichtigste Umsetzungspartner / Partner mit Leistungsverträgen",null,null,null,null,null,null,null,"z.B. Zuständige kantonale Stelle(n) und wichtigste Umsetzungspartner / Partner mit Leistungsverträgen",null,null,null,null,null,null,null,"z.B. Zuständige kantonale Stelle(n) und wichtigste Umsetzungspartner / Partner mit Leistungsverträgen",null,null,null,null,null,null,null,"z.B. Zuständige kantonale Stelle(n) und wichtigste Umsetzungspartner / Partner mit Leistungsverträgen",null,null,null,null,null,null,null,"z.B. Zuständige kantonale Stelle(n) und wichtigste Umsetzungspartner / Partner mit Leistungsverträgen",null,null,null,null,null,null,null,"z.B. Zuständige kantonale Stelle(n) und wichtigste Umsetzungspartner / Partner mit Leistungsverträgen",null,null,null,null,null,null,null,"z.B. Zuständige kantonale Stelle(n) und wichtigste Umsetzungspartner / Partner mit Leistungsverträgen",null,null,null,null,null,null,null,"z.B. Zuständige kantonale Stelle(n) und wichtigste Umsetzungspartner / Partner mit Leistungsverträgen",null,null,null,null,null,null,null,"z.B. Zuständige kantonale Stelle(n) und wichtigste Umsetzungspartner / Partner mit Leistungsverträgen",null,null,null,null,null,null,null,"z.B. Zuständige kantonale Stelle(n) und wichtigste Umsetzungspartner / Partner mit Leistungsverträgen",null,null,null,null,null,null,null,"z.B. Zuständige kantonale Stelle(n) und wichtigste Umsetzungspartner / Partner mit Leistungsverträgen",null,null,null,null,null,null,null,"z.B. Zuständige kantonale Stelle(n) und wichtigste Umsetzungspartner / Partner mit Leistungsverträgen",null,null,null,null,null,null,null,"z.B. Zuständige kantonale Stelle(n) und wichtigste Umsetzungspartner / Partner mit Leistungsverträgen",null,null,null,null,null,null,null,"z.B. Zuständige kantonale Stelle(n) und wichtigste Umsetzungspartner / Partner mit Leistungsverträgen",null,null,null,null,null,null,null,"z.B. Zuständige kantonale Stelle(n) und wichtigste Umsetzungspartner / Partner mit Leistungsverträgen",null,null,null,null,null,null,null,"z.B. Zuständige kantonale Stelle(n) und wichtigste Umsetzungspartner / Partner mit Leistungsverträgen",null,null,null,null,null,null,null,"z.B. Zuständige kantonale Stelle(n) und wichtigste Umsetzungspartner / Partner mit Leistungsverträgen",null,null,null,null,null,null,null,"z.B. Zuständige kantonale Stelle(n) und wichtigste Umsetzungspartner / Partner mit Leistungsverträgen",null,null,null,null,null,null,null,"z.B. Zuständige kantonale Stelle(n) und wichtigste Umsetzungspartner / Partner mit Leistungsverträgen",null,null,null,null,null,null,null,"z.B. Zuständige kantonale Stelle(n) und wichtigste Umsetzungspartner / Partner mit Leistungsverträgen",null,null,null,null,null,null,null,"z.B. Zuständige kantonale Stelle(n) und wichtigste Umsetzungspartner / Partner mit Leistungsverträgen",null,null,null,null,null,null,null,"z.B. Zuständige kantonale Stelle(n) und wichtigste Umsetzungspartner / Partner mit Leistungsverträgen",null,null,null,null,null,null,null,"z.B. Zuständige kantonale Stelle(n) und wichtigste Umsetzungspartner / Partner mit Leistungsverträgen",null,null,null,null,null,null,null,"z.B. Zuständige kantonale Stelle(n) und wichtigste Umsetzungspartner / Partner mit Leistungsverträgen",null,null,null,null,null,null,null,"z.B. Zuständige kantonale Stelle(n) und wichtigste Umsetzungspartner / Partner mit Leistungsverträgen",null,null,null,null,null,null,null,"z.B. Zuständige kantonale Stelle(n) und wichtigste Umsetzungspartner / Partner mit Leistungsverträgen",null,null,null,null,null,null,null,"z.B. Zuständige kantonale Stelle(n) und wichtigste Umsetzungspartner / Partner mit Leistungsverträgen",null,null,null,null,null,null,null,"z.B. Zuständige kantonale Stelle(n) und wichtigste Umsetzungspartner / Partner mit Leistungsverträgen",null,null,null,null,null,null,null,"z.B. Zuständige kantonale Stelle(n) und wichtigste Umsetzungspartner / Partner mit Leistungsverträgen",null,null,null,null,null,null,null,"z.B. Zuständige kantonale Stelle(n) und wichtigste Umsetzungspartner / Partner mit Leistungsverträgen",null,null,null,null,null,null,null,"z.B. Zuständige kantonale Stelle(n) und wichtigste Umsetzungspartner / Partner mit Leistungsverträgen",null,null,null,null,null,null,null,"z.B. Zuständige kantonale Stelle(n) und wichtigste Umsetzungspartner / Partner mit Leistungsverträgen",null,null,null,null,null,null,null,"z.B. Zuständige kantonale Stelle(n) und wichtigste Umsetzungspartner / Partner mit Leistungsverträgen",null,null,null,null,null,null,null,"z.B. Zuständige kantonale Stelle(n) und wichtigste Umsetzungspartner / Partner mit Leistungsverträgen",null,null,null,null,null,null,null,"z.B. Zuständige kantonale Stelle(n) und wichtigste Umsetzungspartner / Partner mit Leistungsverträgen",null,null,null,null,null,null,null,"z.B. Zuständige kantonale Stelle(n) und wichtigste Umsetzungspartner / Partner mit Leistungsverträgen",null,null,null,null,null,null,null,"z.B. Zuständige kantonale Stelle(n) und wichtigste Umsetzungspartner / Partner mit Leistungsverträgen",null,null,null,null,null,null,null,"z.B. Zuständige kantonale Stelle(n) und wichtigste Umsetzungspartner / Partner mit Leistungsverträgen",null,null,null,null,null,null,null,"z.B. Zuständige kantonale Stelle(n) und wichtigste Umsetzungspartner / Partner mit Leistungsverträgen",null,null,null,null,null,null,null,"z.B. Zuständige kantonale Stelle(n) und wichtigste Umsetzungspartner / Partner mit Leistungsverträgen",null,null,null,null,null,null,null,"z.B. Zuständige kantonale Stelle(n) und wichtigste Umsetzungspartner / Partner mit Leistungsverträgen",null,null,null,null,null,null,null,"z.B. Zuständige kantonale Stelle(n) und wichtigste Umsetzungspartner / Partner mit Leistungsverträgen",null,null,null,null,null,null,null,"z.B. Zuständige kantonale Stelle(n) und wichtigste Umsetzungspartner / Partner mit Leistungsverträgen",null,null,null,null,null,null,null,"z.B. Zuständige kantonale Stelle(n) und wichtigste Umsetzungspartner / Partner mit Leistungsverträgen",null,null,null,null,null,null,null,"z.B. Zuständige kantonale Stelle(n) und wichtigste Umsetzungspartner / Partner mit Leistungsverträgen",null,null,null,null,null,null,null,"z.B. Zuständige kantonale Stelle(n) und wichtigste Umsetzungspartner / Partner mit Leistungsverträgen",null,null,null,null,null,null,null,"z.B. Zuständige kantonale Stelle(n) und wichtigste Umsetzungspartner / Partner mit Leistungsverträgen",null,null,null,null,null,null,null,"z.B. Zuständige kantonale Stelle(n) und wichtigste Umsetzungspartner / Partner mit Leistungsverträgen",null,null,null,null,null,null,null,"z.B. Zuständige kantonale Stelle(n) und wichtigste Umsetzungspartner / Partner mit Leistungsverträgen",null,null,null,null,null,null,null,"z.B. Zuständige kantonale Stelle(n) und wichtigste Umsetzungspartner / Partner mit Leistungsverträgen",null,null,null,null,null,null,null,"z.B. Zuständige kantonale Stelle(n) und wichtigste Umsetzungspartner / Partner mit Leistungsverträgen",null,null,null,null,null,null,null,"z.B. Zuständige kantonale Stelle(n) und wichtigste Umsetzungspartner / Partner mit Leistungsverträgen",null,null,null,null,null,null,null,"z.B. Zuständige kantonale Stelle(n) und wichtigste Umsetzungspartner / Partner mit Leistungsverträgen",null,null,null,null,null,null,null,"z.B. Zuständige kantonale Stelle(n) und wichtigste Umsetzungspartner / Partner mit Leistungsverträgen",null,null,null,null,null,null,null,"z.B. Zuständige kantonale Stelle(n) und wichtigste Umsetzungspartner / Partner mit Leistungsverträgen",null,null,null,null,null,null,null,"z.B. Zuständige kantonale Stelle(n) und wichtigste Umsetzungspartner / Partner mit Leistungsverträgen",null,null,null,null,null,null,null,"z.B. Zuständige kantonale Stelle(n) und wichtigste Umsetzungspartner / Partner mit Leistungsverträgen",null,null,null,null,null,null,null,"z.B. Zuständige kantonale Stelle(n) und wichtigste Umsetzungspartner / Partner mit Leistungsverträgen",null,null,null,null,null,null,null,"z.B. Zuständige kantonale Stelle(n) und wichtigste Umsetzungspartner / Partner mit Leistungsverträgen",null,null,null,null,null,null,null,"z.B. Zuständige kantonale Stelle(n) und wichtigste Umsetzungspartner / Partner mit Leistungsverträgen",null,null,null,null,null,null,null,"z.B. Zuständige kantonale Stelle(n) und wichtigste Umsetzungspartner / Partner mit Leistungsverträgen",null,null,null,null,null,null,null,"z.B. Zuständige kantonale Stelle(n) und wichtigste Umsetzungspartner / Partner mit Leistungsverträgen",null,null,null,null,null,null,null,"z.B. Zuständige kantonale Stelle(n) und wichtigste Umsetzungspartner / Partner mit Leistungsverträgen",null,null,null,null,null,null,null,"z.B. Zuständige kantonale Stelle(n) und wichtigste Umsetzungspartner / Partner mit Leistungsverträgen",null,null,null,null,null,null,null,"z.B. Zuständige kantonale Stelle(n) und wichtigste Umsetzungspartner / Partner mit Leistungsverträgen",null,null,null,null,null,null,null,"z.B. Zuständige kantonale Stelle(n) und wichtigste Umsetzungspartner / Partner mit Leistungsverträgen",null,null,null,null,null,null,null,"z.B. Zuständige kantonale Stelle(n) und wichtigste Umsetzungspartner / Partner mit Leistungsverträgen",null,null,null,null,null,null,null,"z.B. Zuständige kantonale Stelle(n) und wichtigste Umsetzungspartner / Partner mit Leistungsverträgen",null,null,null,null,null,null,null,"z.B. Zuständige kantonale Stelle(n) und wichtigste Umsetzungspartner / Partner mit Leistungsverträgen",null,null,null,null,null,null,null,"z.B. Zuständige kantonale Stelle(n) und wichtigste Umsetzungspartner / Partner mit Leistungsverträgen",null,null,null,null,null,null,null,"z.B. Zuständige kantonale Stelle(n) und wichtigste Umsetzungspartner / Partner mit Leistungsverträgen",null,null,null,null,null,null,null,"z.B. Zuständige kantonale Stelle(n) und wichtigste Umsetzungspartner / Partner mit Leistungsverträgen",null,null,null,null,null,null,null,"z.B. Zuständige kantonale Stelle(n) und wichtigste Umsetzungspartner / Partner mit Leistungsverträgen",null,null,null,null,null,null,null,"z.B. Zuständige kantonale Stelle(n) und wichtigste Umsetzungspartner / Partner mit Leistungsverträgen",null,null,null,null,null,null,null,"z.B. Zuständige kantonale Stelle(n) und wichtigste Umsetzungspartner / Partner mit Leistungsverträgen",null,null,null,null,null,null,null,"z.B. Zuständige kantonale Stelle(n) und wichtigste Umsetzungspartner / Partner mit Leistungsverträgen",null,null,null,null,null,null,null,"z.B. Zuständige kantonale Stelle(n) und wichtigste Umsetzungspartner / Partner mit Leistungsverträgen",null,null,null,null,null,null,null,"z.B. Zuständige kantonale Stelle(n) und wichtigste Umsetzungspartner / Partner mit Leistungsverträgen",null,null,null,null,null,null,null,"z.B. Zuständige kantonale Stelle(n) und wichtigste Umsetzungspartner / Partner mit Leistungsverträgen",null,null,null,null,null,null,null,"z.B. Zuständige kantonale Stelle(n) und wichtigste Umsetzungspartner / Partner mit Leistungsverträgen",null,null,null,null,null,null,null,"z.B. Zuständige kantonale Stelle(n) und wichtigste Umsetzungspartner / Partner mit Leistungsverträgen",null,null,null,null,null,null,null,"z.B. Zuständige kantonale Stelle(n) und wichtigste Umsetzungspartner / Partner mit Leistungsverträgen",null,null,null,null,null,null,null,"z.B. Zuständige kantonale Stelle(n) und wichtigste Umsetzungspartner / Partner mit Leistungsverträgen",null,null,null,null,null,null,null,"z.B. Zuständige kantonale Stelle(n) und wichtigste Umsetzungspartner / Partner mit Leistungsverträgen",null,null,null,null,null,null,null,"z.B. Zuständige kantonale Stelle(n) und wichtigste Umsetzungspartner / Partner mit Leistungsverträgen",null,null,null,null,null,null,null,"z.B. Zuständige kantonale Stelle(n) und wichtigste Umsetzungspartner / Partner mit Leistungsverträgen",null,null,null,null,null,null,null,"z.B. Zuständige kantonale Stelle(n) und wichtigste Umsetzungspartner / Partner mit Leistungsverträgen",null,null,null,null,null,null,null,"z.B. Zuständige kantonale Stelle(n) und wichtigste Umsetzungspartner / Partner mit Leistungsverträgen",null,null,null,null,null,null,null,"z.B. Zuständige kantonale Stelle(n) und wichtigste Umsetzungspartner / Partner mit Leistungsverträgen",null,null,null,null,null,null,null,"z.B. Zuständige kantonale Stelle(n) und wichtigste Umsetzungspartner / Partner mit Leistungsverträgen",null,null,null,null,null,null,null,"z.B. Zuständige kantonale Stelle(n) und wichtigste Umsetzungspartner / Partner mit Leistungsverträgen",null,null,null,null,null,null,null,"z.B. Zuständige kantonale Stelle(n) und wichtigste Umsetzungspartner / Partner mit Leistungsverträgen",null,null,null,null,null,null,null,"z.B. Zuständige kantonale Stelle(n) und wichtigste Umsetzungspartner / Partner mit Leistungsverträgen",null,null,null,null,null,null,null,"z.B. Zuständige kantonale Stelle(n) und wichtigste Umsetzungspartner / Partner mit Leistungsverträgen",null,null,null,null,null,null,null,"z.B. Zuständige kantonale Stelle(n) und wichtigste Umsetzungspartner / Partner mit Leistungsverträgen",null,null,null,null,null,null,null,"z.B. Zuständige kantonale Stelle(n) und wichtigste Umsetzungspartner / Partner mit Leistungsverträgen",null,null,null,null,null,null,null,"z.B. Zuständige kantonale Stelle(n) und wichtigste Umsetzungspartner / Partner mit Leistungsverträgen",null,null,null,null,null,null,null,"z.B. Zuständige kantonale Stelle(n) und wichtigste Umsetzungspartner / Partner mit Leistungsverträgen",null,null,null,null,null,null,null,"z.B. Zuständige kantonale Stelle(n) und wichtigste Umsetzungspartner / Partner mit Leistungsverträgen",null,null,null,null,null,null,null,"z.B. Zuständige kantonale Stelle(n) und wichtigste Umsetzungspartner / Partner mit Leistungsverträgen",null,null,null,null,null,null,null,"z.B. Zuständige kantonale Stelle(n) und wichtigste Umsetzungspartner / Partner mit Leistungsverträgen",null,null,null,null,null,null,null,"z.B. Zuständige kantonale Stelle(n) und wichtigste Umsetzungspartner / Partner mit Leistungsverträgen",null,null,null,null,null,null,null,"z.B. Zuständige kantonale Stelle(n) und wichtigste Umsetzungspartner / Partner mit Leistungsverträgen",null,null,null,null,null,null,null,"z.B. Zuständige kantonale Stelle(n) und wichtigste Umsetzungspartner / Partner mit Leistungsverträgen",null,null,null,null,null,null,null,"z.B. Zuständige kantonale Stelle(n) und wichtigste Umsetzungspartner / Partner mit Leistungsverträgen",null,null,null,null,null,null,null,"z.B. Zuständige kantonale Stelle(n) und wichtigste Umsetzungspartner / Partner mit Leistungsverträgen",null,null,null,null,null,null,null,"z.B. Zuständige kantonale Stelle(n) und wichtigste Umsetzungspartner / Partner mit Leistungsverträgen",null,null,null,null,null,null,null,"z.B. Zuständige kantonale Stelle(n) und wichtigste Umsetzungspartner / Partner mit Leistungsverträgen",null,null,null,null,null,null,null,"z.B. Zuständige kantonale Stelle(n) und wichtigste Umsetzungspartner / Partner mit Leistungsverträgen",null,null,null,null,null,null,null,"z.B. Zuständige kantonale Stelle(n) und wichtigste Umsetzungspartner / Partner mit Leistungsverträgen",null,null,null,null,null,null,null,"z.B. Zuständige kantonale Stelle(n) und wichtigste Umsetzungspartner / Partner mit Leistungsverträgen",null,null,null,null,null,null,null,"z.B. Zuständige kantonale Stelle(n) und wichtigste Umsetzungspartner / Partner mit Leistungsverträgen",null,null,null,null,null,null,null,"z.B. Zuständige kantonale Stelle(n) und wichtigste Umsetzungspartner / Partner mit Leistungsverträgen",null,null,null,null,null,null,null,"z.B. Zuständige kantonale Stelle(n) und wichtigste Umsetzungspartner / Partner mit Leistungsverträgen",null,null,null,null,null,null,null,"z.B. Zuständige kantonale Stelle(n) und wichtigste Umsetzungspartner / Partner mit Leistungsverträgen",null,null,null,null,null,null,null,"z.B. Zuständige kantonale Stelle(n) und wichtigste Umsetzungspartner / Partner mit Leistungsverträgen",null,null,null,null,null,null,null,"z.B. Zuständige kantonale Stelle(n) und wichtigste Umsetzungspartner / Partner mit Leistungsverträgen",null,null,null,null,null,null,null,"z.B. Zuständige kantonale Stelle(n) und wichtigste Umsetzungspartner / Partner mit Leistungsverträgen",null,null,null,null,null,null,null,"z.B. Zuständige kantonale Stelle(n) und wichtigste Umsetzungspartner / Partner mit Leistungsverträgen",null,null,null,null,null,null,null,"z.B. Zuständige kantonale Stelle(n) und wichtigste Umsetzungspartner / Partner mit Leistungsverträgen",null,null,null,null,null,null,null,"z.B. Zuständige kantonale Stelle(n) und wichtigste Umsetzungspartner / Partner mit Leistungsverträgen",null,null,null,null,null,null,null,"z.B. Zuständige kantonale Stelle(n) und wichtigste Umsetzungspartner / Partner mit Leistungsverträgen",null,null,null,null,null,null,null,"z.B. Zuständige kantonale Stelle(n) und wichtigste Umsetzungspartner / Partner mit Leistungsverträgen",null,null,null,null,null,null,null,"z.B. Zuständige kantonale Stelle(n) und wichtigste Umsetzungspartner / Partner mit Leistungsverträgen",null,null,null,null,null,null,null,"z.B. Zuständige kantonale Stelle(n) und wichtigste Umsetzungspartner / Partner mit Leistungsverträgen",null,null,null,null,null,null,null,"z.B. Zuständige kantonale Stelle(n) und wichtigste Umsetzungspartner / Partner mit Leistungsverträgen",null,null,null,null,null,null,null,"z.B. Zuständige kantonale Stelle(n) und wichtigste Umsetzungspartner / Partner mit Leistungsverträgen",null,null,null,null,null,null,null,"z.B. Zuständige kantonale Stelle(n) und wichtigste Umsetzungspartner / Partner mit Leistungsverträgen",null,null,null,null,null,null,null,"z.B. Zuständige kantonale Stelle(n) und wichtigste Umsetzungspartner / Partner mit Leistungsverträgen",null,null,null,null,null,null,null,"z.B. Zuständige kantonale Stelle(n) und wichtigste Umsetzungspartner / Partner mit Leistungsverträgen",null,null,null,null,null,null,null,"z.B. Zuständige kantonale Stelle(n) und wichtigste Umsetzungspartner / Partner mit Leistungsverträgen",null,null,null,null,null,null,null,"z.B. Zuständige kantonale Stelle(n) und wichtigste Umsetzungspartner / Partner mit Leistungsverträgen",null,null,null,null,null,null,null,"z.B. Zuständige kantonale Stelle(n) und wichtigste Umsetzungspartner / Partner mit Leistungsverträgen",null,null,null,null,null,null,null,"z.B. Zuständige kantonale Stelle(n) und wichtigste Umsetzungspartner / Partner mit Leistungsverträgen",null,null,null,null,null,null,null,"z.B. Zuständige kantonale Stelle(n) und wichtigste Umsetzungspartner / Partner mit Leistungsverträgen",null,null,null,null,null,null,null,"z.B. Zuständige kantonale Stelle(n) und wichtigste Umsetzungspartner / Partner mit Leistungsverträgen",null,null,null,null,null,null,null,"z.B. Zuständige kantonale Stelle(n) und wichtigste Umsetzungspartner / Partner mit Leistungsverträgen",null,null,null,null,null,null,null,"z.B. Zuständige kantonale Stelle(n) und wichtigste Umsetzungspartner / Partner mit Leistungsverträgen",null,null,null,null,null,null,null,"z.B. Zuständige kantonale Stelle(n) und wichtigste Umsetzungspartner / Partner mit Leistungsverträgen",null,null,null,null,null,null,null,"z.B. Zuständige kantonale Stelle(n) und wichtigste Umsetzungspartner / Partner mit Leistungsverträgen",null,null,null,null,null,null,null,"z.B. Zuständige kantonale Stelle(n) und wichtigste Umsetzungspartner / Partner mit Leistungsverträgen",null,null,null,null,null,null,null,"z.B. Zuständige kantonale Stelle(n) und wichtigste Umsetzungspartner / Partner mit Leistungsverträgen",null,null,null,null,null,null,null,"z.B. Zuständige kantonale Stelle(n) und wichtigste Umsetzungspartner / Partner mit Leistungsverträgen",null,null,null,null,null,null,null,"z.B. Zuständige kantonale Stelle(n) und wichtigste Umsetzungspartner / Partner mit Leistungsverträgen",null,null,null,null,null,null,null,"z.B. Zuständige kantonale Stelle(n) und wichtigste Umsetzungspartner / Partner mit Leistungsverträgen",null,null,null,null,null,null,null,"z.B. Zuständige kantonale Stelle(n) und wichtigste Umsetzungspartner / Partner mit Leistungsverträgen",null,null,null,null,null,null,null,"z.B. Zuständige kantonale Stelle(n) und wichtigste Umsetzungspartner / Partner mit Leistungsverträgen",null,null,null,null,null,null,null,"z.B. Zuständige kantonale Stelle(n) und wichtigste Umsetzungspartner / Partner mit Leistungsverträgen",null,null,null,null,null,null,null,"z.B. Zuständige kantonale Stelle(n) und wichtigste Umsetzungspartner / Partner mit Leistungsverträgen",null,null,null,null,null,null,null,"z.B. Zuständige kantonale Stelle(n) und wichtigste Umsetzungspartner / Partner mit Leistungsverträgen",null,null,null,null,null,null,null,"z.B. Zuständige kantonale Stelle(n) und wichtigste Umsetzungspartner / Partner mit Leistungsverträgen",null,null,null,null,null,null,null,"z.B. Zuständige kantonale Stelle(n) und wichtigste Umsetzungspartner / Partner mit Leistungsverträgen",null,null,null,null,null,null,null,"z.B. Zuständige kantonale Stelle(n) und wichtigste Umsetzungspartner / Partner mit Leistungsverträgen",null,null,null,null,null,null,null,"z.B. Zuständige kantonale Stelle(n) und wichtigste Umsetzungspartner / Partner mit Leistungsverträgen",null,null,null,null,null,null,null,"z.B. Zuständige kantonale Stelle(n) und wichtigste Umsetzungspartner / Partner mit Leistungsverträgen",null,null,null,null,null,null,null,"z.B. Zuständige kantonale Stelle(n) und wichtigste Umsetzungspartner / Partner mit Leistungsverträgen",null,null,null,null,null,null,null,"z.B. Zuständige kantonale Stelle(n) und wichtigste Umsetzungspartner / Partner mit Leistungsverträgen",null,null,null,null,null,null,null,"z.B. Zuständige kantonale Stelle(n) und wichtigste Umsetzungspartner / Partner mit Leistungsverträgen",null,null,null,null,null,null,null,"z.B. Zuständige kantonale Stelle(n) und wichtigste Umsetzungspartner / Partner mit Leistungsverträgen",null,null,null,null,null,null,null,"z.B. Zuständige kantonale Stelle(n) und wichtigste Umsetzungspartner / Partner mit Leistungsverträgen",null,null,null,null,null,null,null,"z.B. Zuständige kantonale Stelle(n) und wichtigste Umsetzungspartner / Partner mit Leistungsverträgen",null,null,null,null,null,null,null,"z.B. Zuständige kantonale Stelle(n) und wichtigste Umsetzungspartner / Partner mit Leistungsverträgen",null,null,null,null,null,null,null,"z.B. Zuständige kantonale Stelle(n) und wichtigste Umsetzungspartner / Partner mit Leistungsverträgen",null,null,null,null,null,null,null,"z.B. Zuständige kantonale Stelle(n) und wichtigste Umsetzungspartner / Partner mit Leistungsverträgen",null,null,null,null,null,null,null,"z.B. Zuständige kantonale Stelle(n) und wichtigste Umsetzungspartner / Partner mit Leistungsverträgen",null,null,null,null,null,null,null,"z.B. Zuständige kantonale Stelle(n) und wichtigste Umsetzungspartner / Partner mit Leistungsverträgen",null,null,null,null,null,null,null,"z.B. Zuständige kantonale Stelle(n) und wichtigste Umsetzungspartner / Partner mit Leistungsverträgen",null,null,null,null,null,null,null,"z.B. Zuständige kantonale Stelle(n) und wichtigste Umsetzungspartner / Partner mit Leistungsverträgen",null,null,null,null,null,null,null,"z.B. Zuständige kantonale Stelle(n) und wichtigste Umsetzungspartner / Partner mit Leistungsverträgen",null,null,null,null,null,null,null,"z.B. Zuständige kantonale Stelle(n) und wichtigste Umsetzungspartner / Partner mit Leistungsverträgen",null,null,null,null,null,null,null,"z.B. Zuständige kantonale Stelle(n) und wichtigste Umsetzungspartner / Partner mit Leistungsverträgen",null,null,null,null,null,null,null,"z.B. Zuständige kantonale Stelle(n) und wichtigste Umsetzungspartner / Partner mit Leistungsverträgen",null,null,null,null,null,null,null,"z.B. Zuständige kantonale Stelle(n) und wichtigste Umsetzungspartner / Partner mit Leistungsverträgen",null,null,null,null,null,null,null,"z.B. Zuständige kantonale Stelle(n) und wichtigste Umsetzungspartner / Partner mit Leistungsverträgen",null,null,null,null,null,null,null,"z.B. Zuständige kantonale Stelle(n) und wichtigste Umsetzungspartner / Partner mit Leistungsverträgen",null,null,null,null,null,null,null,"z.B. Zuständige kantonale Stelle(n) und wichtigste Umsetzungspartner / Partner mit Leistungsverträgen",null,null,null,null,null,null,null,"z.B. Zuständige kantonale Stelle(n) und wichtigste Umsetzungspartner / Partner mit Leistungsverträgen",null,null,null,null,null,null,null,"z.B. Zuständige kantonale Stelle(n) und wichtigste Umsetzungspartner / Partner mit Leistungsverträgen",null,null,null,null,null,null,null,"z.B. Zuständige kantonale Stelle(n) und wichtigste Umsetzungspartner / Partner mit Leistungsverträgen",null,null,null,null,null,null,null,"z.B. Zuständige kantonale Stelle(n) und wichtigste Umsetzungspartner / Partner mit Leistungsverträgen",null,null,null,null,null,null,null,"z.B. Zuständige kantonale Stelle(n) und wichtigste Umsetzungspartner / Partner mit Leistungsverträgen",null,null,null,null,null,null,null,"z.B. Zuständige kantonale Stelle(n) und wichtigste Umsetzungspartner / Partner mit Leistungsverträgen",null,null,null,null,null,null,null,"z.B. Zuständige kantonale Stelle(n) und wichtigste Umsetzungspartner / Partner mit Leistungsverträgen",null,null,null,null,null,null,null,"z.B. Zuständige kantonale Stelle(n) und wichtigste Umsetzungspartner / Partner mit Leistungsverträgen",null,null,null,null,null,null,null,"z.B. Zuständige kantonale Stelle(n) und wichtigste Umsetzungspartner / Partner mit Leistungsverträgen",null,null,null,null,null,null,null,"z.B. Zuständige kantonale Stelle(n) und wichtigste Umsetzungspartner / Partner mit Leistungsverträgen",null,null,null,null,null,null,null,"z.B. Zuständige kantonale Stelle(n) und wichtigste Umsetzungspartner / Partner mit Leistungsverträgen",null,null,null,null,null,null,null,"z.B. Zuständige kantonale Stelle(n) und wichtigste Umsetzungspartner / Partner mit Leistungsverträgen",null,null,null,null,null,null,null,"z.B. Zuständige kantonale Stelle(n) und wichtigste Umsetzungspartner / Partner mit Leistungsverträgen",null,null,null,null,null,null,null,"z.B. Zuständige kantonale Stelle(n) und wichtigste Umsetzungspartner / Partner mit Leistungsverträgen",null,null,null,null,null,null,null,"z.B. Zuständige kantonale Stelle(n) und wichtigste Umsetzungspartner / Partner mit Leistungsverträgen",null,null,null,null,null,null,null,"z.B. Zuständige kantonale Stelle(n) und wichtigste Umsetzungspartner / Partner mit Leistungsverträgen",null,null,null,null,null,null,null,"z.B. Zuständige kantonale Stelle(n) und wichtigste Umsetzungspartner / Partner mit Leistungsverträgen",null,null,null,null,null,null,null,"z.B. Zuständige kantonale Stelle(n) und wichtigste Umsetzungspartner / Partner mit Leistungsverträgen",null,null,null,null,null,null,null,"z.B. Zuständige kantonale Stelle(n) und wichtigste Umsetzungspartner / Partner mit Leistungsverträgen",null,null,null,null,null,null,null,"z.B. Zuständige kantonale Stelle(n) und wichtigste Umsetzungspartner / Partner mit Leistungsverträgen",null,null,null,null,null,null,null,"z.B. Zuständige kantonale Stelle(n) und wichtigste Umsetzungspartner / Partner mit Leistungsverträgen",null,null,null,null,null,null,null,"z.B. Zuständige kantonale Stelle(n) und wichtigste Umsetzungspartner / Partner mit Leistungsverträgen",null,null,null,null,null,null,null,"z.B. Zuständige kantonale Stelle(n) und wichtigste Umsetzungspartner / Partner mit Leistungsverträgen",null,null,null,null,null,null,null,"z.B. Zuständige kantonale Stelle(n) und wichtigste Umsetzungspartner / Partner mit Leistungsverträgen",null,null,null,null,null,null,null,"z.B. Zuständige kantonale Stelle(n) und wichtigste Umsetzungspartner / Partner mit Leistungsverträgen",null,null,null,null,null,null,null,"z.B. Zuständige kantonale Stelle(n) und wichtigste Umsetzungspartner / Partner mit Leistungsverträgen",null,null,null,null,null,null,null,"z.B. Zuständige kantonale Stelle(n) und wichtigste Umsetzungspartner / Partner mit Leistungsverträgen",null,null,null,null,null,null,null,"z.B. Zuständige kantonale Stelle(n) und wichtigste Umsetzungspartner / Partner mit Leistungsverträgen",null,null,null,null,null,null,null,"z.B. Zuständige kantonale Stelle(n) und wichtigste Umsetzungspartner / Partner mit Leistungsverträgen",null,null,null,null,null,null,null,"z.B. Zuständige kantonale Stelle(n) und wichtigste Umsetzungspartner / Partner mit Leistungsverträgen",null,null,null,null,null,null,null,"z.B. Zuständige kantonale Stelle(n) und wichtigste Umsetzungspartner / Partner mit Leistungsverträgen",null,null,null,null,null,null,null,"z.B. Zuständige kantonale Stelle(n) und wichtigste Umsetzungspartner / Partner mit Leistungsverträgen",null,null,null,null,null,null,null,"z.B. Zuständige kantonale Stelle(n) und wichtigste Umsetzungspartner / Partner mit Leistungsverträgen",null,null,null,null,null,null,null,"z.B. Zuständige kantonale Stelle(n) und wichtigste Umsetzungspartner / Partner mit Leistungsverträgen",null,null,null,null,null,null,null,"z.B. Zuständige kantonale Stelle(n) und wichtigste Umsetzungspartner / Partner mit Leistungsverträgen",null,null,null,null,null,null,null,"z.B. Zuständige kantonale Stelle(n) und wichtigste Umsetzungspartner / Partner mit Leistungsverträgen",null,null,null,null,null,null,null,"z.B. Zuständige kantonale Stelle(n) und wichtigste Umsetzungspartner / Partner mit Leistungsverträgen",null,null,null,null,null,null,null,"z.B. Zuständige kantonale Stelle(n) und wichtigste Umsetzungspartner / Partner mit Leistungsverträgen",null,null,null,null,null,null,null,"z.B. Zuständige kantonale Stelle(n) und wichtigste Umsetzungspartner / Partner mit Leistungsverträgen",null,null,null,null,null,null,null,"z.B. Zuständige kantonale Stelle(n) und wichtigste Umsetzungspartner / Partner mit Leistungsverträgen",null,null,null,null,null,null,null,"z.B. Zuständige kantonale Stelle(n) und wichtigste Umsetzungspartner / Partner mit Leistungsverträgen",null,null,null,null,null,null,null,"z.B. Zuständige kantonale Stelle(n) und wichtigste Umsetzungspartner / Partner mit Leistungsverträgen",null,null,null,null,null,null,null,"z.B. Zuständige kantonale Stelle(n) und wichtigste Umsetzungspartner / Partner mit Leistungsverträgen",null,null,null,null,null,null,null,"z.B. Zuständige kantonale Stelle(n) und wichtigste Umsetzungspartner / Partner mit Leistungsverträgen",null,null,null,null,null,null,null,"z.B. Zuständige kantonale Stelle(n) und wichtigste Umsetzungspartner / Partner mit Leistungsverträgen",null,null,null,null,null,null,null,"z.B. Zuständige kantonale Stelle(n) und wichtigste Umsetzungspartner / Partner mit Leistungsverträgen",null,null,null,null,null,null,null,"z.B. Zuständige kantonale Stelle(n) und wichtigste Umsetzungspartner / Partner mit Leistungsverträgen",null,null,null,null,null,null,null,"z.B. Zuständige kantonale Stelle(n) und wichtigste Umsetzungspartner / Partner mit Leistungsverträgen",null,null,null,null,null,null,null,"z.B. Zuständige kantonale Stelle(n) und wichtigste Umsetzungspartner / Partner mit Leistungsverträgen",null,null,null,null,null,null,null,"z.B. Zuständige kantonale Stelle(n) und wichtigste Umsetzungspartner / Partner mit Leistungsverträgen",null,null,null,null,null,null,null,"z.B. Zuständige kantonale Stelle(n) und wichtigste Umsetzungspartner / Partner mit Leistungsverträgen",null,null,null,null,null,null,null,"z.B. Zuständige kantonale Stelle(n) und wichtigste Umsetzungspartner / Partner mit Leistungsverträgen",null,null,null,null,null,null,null,"z.B. Zuständige kantonale Stelle(n) und wichtigste Umsetzungspartner / Partner mit Leistungsverträgen",null,null,null,null,null,null,null,"z.B. Zuständige kantonale Stelle(n) und wichtigste Umsetzungspartner / Partner mit Leistungsverträgen",null,null,null,null,null,null,null,"z.B. Zuständige kantonale Stelle(n) und wichtigste Umsetzungspartner / Partner mit Leistungsverträgen",null,null,null,null,null,null,null,"z.B. Zuständige kantonale Stelle(n) und wichtigste Umsetzungspartner / Partner mit Leistungsverträgen",null,null,null,null,null,null,null,"z.B. Zuständige kantonale Stelle(n) und wichtigste Umsetzungspartner / Partner mit Leistungsverträgen",null,null,null,null,null,null,null,"z.B. Zuständige kantonale Stelle(n) und wichtigste Umsetzungspartner / Partner mit Leistungsverträgen",null,null,null,null,null,null,null,"z.B. Zuständige kantonale Stelle(n) und wichtigste Umsetzungspartner / Partner mit Leistungsverträgen",null,null,null,null,null,null,null,"z.B. Zuständige kantonale Stelle(n) und wichtigste Umsetzungspartner / Partner mit Leistungsverträgen",null,null,null,null,null,null,null,"z.B. Zuständige kantonale Stelle(n) und wichtigste Umsetzungspartner / Partner mit Leistungsverträgen",null,null,null,null,null,null,null,"z.B. Zuständige kantonale Stelle(n) und wichtigste Umsetzungspartner / Partner mit Leistungsverträgen",null,null,null,null,null,null,null,"z.B. Zuständige kantonale Stelle(n) und wichtigste Umsetzungspartner / Partner mit Leistungsverträgen",null,null,null,null,null,null,null,"z.B. Zuständige kantonale Stelle(n) und wichtigste Umsetzungspartner / Partner mit Leistungsverträgen",null,null,null,null,null,null,null,"z.B. Zuständige kantonale Stelle(n) und wichtigste Umsetzungspartner / Partner mit Leistungsverträgen",null,null,null,null,null,null,null,"z.B. Zuständige kantonale Stelle(n) und wichtigste Umsetzungspartner / Partner mit Leistungsverträgen",null,null,null,null,null,null,null,"z.B. Zuständige kantonale Stelle(n) und wichtigste Umsetzungspartner / Partner mit Leistungsverträgen",null,null,null,null,null,null,null,"z.B. Zuständige kantonale Stelle(n) und wichtigste Umsetzungspartner / Partner mit Leistungsverträgen",null,null,null,null,null,null,null,"z.B. Zuständige kantonale Stelle(n) und wichtigste Umsetzungspartner / Partner mit Leistungsverträgen",null,null,null,null,null,null,null,"z.B. Zuständige kantonale Stelle(n) und wichtigste Umsetzungspartner / Partner mit Leistungsverträgen",null,null,null,null,null,null,null,"z.B. Zuständige kantonale Stelle(n) und wichtigste Umsetzungspartner / Partner mit Leistungsverträgen",null,null,null,null,null,null,null,"z.B. Zuständige kantonale Stelle(n) und wichtigste Umsetzungspartner / Partner mit Leistungsverträgen",null,null,null,null,null,null,null,"z.B. Zuständige kantonale Stelle(n) und wichtigste Umsetzungspartner / Partner mit Leistungsverträgen",null,null,null,null,null,null,null,"z.B. Zuständige kantonale Stelle(n) und wichtigste Umsetzungspartner / Partner mit Leistungsverträgen",null,null,null,null,null,null,null,"z.B. Zuständige kantonale Stelle(n) und wichtigste Umsetzungspartner / Partner mit Leistungsverträgen",null,null,null,null,null,null,null,"z.B. Zuständige kantonale Stelle(n) und wichtigste Umsetzungspartner / Partner mit Leistungsverträgen",null,null,null,null,null,null,null,"z.B. Zuständige kantonale Stelle(n) und wichtigste Umsetzungspartner / Partner mit Leistungsverträgen",null,null,null,null,null,null,null,"z.B. Zuständige kantonale Stelle(n) und wichtigste Umsetzungspartner / Partner mit Leistungsverträgen",null,null,null,null,null,null,null,"z.B. Zuständige kantonale Stelle(n) und wichtigste Umsetzungspartner / Partner mit Leistungsverträgen",null,null,null,null,null,null,null,"z.B. Zuständige kantonale Stelle(n) und wichtigste Umsetzungspartner / Partner mit Leistungsverträgen",null,null,null,null,null,null,null,"z.B. Zuständige kantonale Stelle(n) und wichtigste Umsetzungspartner / Partner mit Leistungsverträgen",null,null,null,null,null,null,null,"z.B. Zuständige kantonale Stelle(n) und wichtigste Umsetzungspartner / Partner mit Leistungsverträgen",null,null,null,null,null,null,null,"z.B. Zuständige kantonale Stelle(n) und wichtigste Umsetzungspartner / Partner mit Leistungsverträgen",null,null,null,null,null,null,null,"z.B. Zuständige kantonale Stelle(n) und wichtigste Umsetzungspartner / Partner mit Leistungsverträgen",null,null,null,null,null,null,null,"z.B. Zuständige kantonale Stelle(n) und wichtigste Umsetzungspartner / Partner mit Leistungsverträgen",null,null,null,null,null,null,null,"z.B. Zuständige kantonale Stelle(n) und wichtigste Umsetzungspartner / Partner mit Leistungsverträgen",null,null,null,null,null,null,null,"z.B. Zuständige kantonale Stelle(n) und wichtigste Umsetzungspartner / Partner mit Leistungsverträgen",null,null,null,null,null,null,null,"z.B. Zuständige kantonale Stelle(n) und wichtigste Umsetzungspartner / Partner mit Leistungsverträgen",null,null,null,null,null,null,null,"z.B. Zuständige kantonale Stelle(n) und wichtigste Umsetzungspartner / Partner mit Leistungsverträgen",null,null,null,null,null,null,null,"z.B. Zuständige kantonale Stelle(n) und wichtigste Umsetzungspartner / Partner mit Leistungsverträgen",null,null,null,null,null,null,null,"z.B. Zuständige kantonale Stelle(n) und wichtigste Umsetzungspartner / Partner mit Leistungsverträgen",null,null,null,null,null,null,null,"z.B. Zuständige kantonale Stelle(n) und wichtigste Umsetzungspartner / Partner mit Leistungsverträgen",null,null,null,null,null,null,null,"z.B. Zuständige kantonale Stelle(n) und wichtigste Umsetzungspartner / Partner mit Leistungsverträgen",null,null,null,null,null,null,null,"z.B. Zuständige kantonale Stelle(n) und wichtigste Umsetzungspartner / Partner mit Leistungsverträgen",null,null,null,null,null,null,null,"z.B. Zuständige kantonale Stelle(n) und wichtigste Umsetzungspartner / Partner mit Leistungsverträgen",null,null,null,null,null,null,null,"z.B. Zuständige kantonale Stelle(n) und wichtigste Umsetzungspartner / Partner mit Leistungsverträgen",null,null,null,null,null,null,null,"z.B. Zuständige kantonale Stelle(n) und wichtigste Umsetzungspartner / Partner mit Leistungsverträgen",null,null,null,null,null,null,null,"z.B. Zuständige kantonale Stelle(n) und wichtigste Umsetzungspartner / Partner mit Leistungsverträgen",null,null,null,null,null,null,null,"z.B. Zuständige kantonale Stelle(n) und wichtigste Umsetzungspartner / Partner mit Leistungsverträgen",null,null,null,null,null,null,null,"z.B. Zuständige kantonale Stelle(n) und wichtigste Umsetzungspartner / Partner mit Leistungsverträgen",null,null,null,null,null,null,null,"z.B. Zuständige kantonale Stelle(n) und wichtigste Umsetzungspartner / Partner mit Leistungsverträgen",null,null,null,null,null,null,null,"z.B. Zuständige kantonale Stelle(n) und wichtigste Umsetzungspartner / Partner mit Leistungsverträgen",null,null,null,null,null,null,null,"z.B. Zuständige kantonale Stelle(n) und wichtigste Umsetzungspartner / Partner mit Leistungsverträgen",null,null,null,null,null,null,null,"z.B. Zuständige kantonale Stelle(n) und wichtigste Umsetzungspartner / Partner mit Leistungsverträgen",null,null,null,null,null,null,null,"z.B. Zuständige kantonale Stelle(n) und wichtigste Umsetzungspartner / Partner mit Leistungsverträgen",null,null,null,null,null,null,null,"z.B. Zuständige kantonale Stelle(n) und wichtigste Umsetzungspartner / Partner mit Leistungsverträgen",null,null,null,null,null,null,null,"z.B. Zuständige kantonale Stelle(n) und wichtigste Umsetzungspartner / Partner mit Leistungsverträgen",null,null,null,null,null,null,null,"z.B. Zuständige kantonale Stelle(n) und wichtigste Umsetzungspartner / Partner mit Leistungsverträgen",null,null,null,null,null,null,null,"z.B. Zuständige kantonale Stelle(n) und wichtigste Umsetzungspartner / Partner mit Leistungsverträgen",null,null,null,null,null,null,null,"z.B. Zuständige kantonale Stelle(n) und wichtigste Umsetzungspartner / Partner mit Leistungsverträgen",null,null,null,null,null,null,null,"z.B. Zuständige kantonale Stelle(n) und wichtigste Umsetzungspartner / Partner mit Leistungsverträgen",null,null,null,null,null,null,null,"z.B. Zuständige kantonale Stelle(n) und wichtigste Umsetzungspartner / Partner mit Leistungsverträgen",null,null,null,null,null,null,null,"z.B. Zuständige kantonale Stelle(n) und wichtigste Umsetzungspartner / Partner mit Leistungsverträgen",null,null,null,null,null,null,null,"z.B. Zuständige kantonale Stelle(n) und wichtigste Umsetzungspartner / Partner mit Leistungsverträgen",null,null,null,null,null,null,null,"z.B. Zuständige kantonale Stelle(n) und wichtigste Umsetzungspartner / Partner mit Leistungsverträgen",null,null,null,null,null,null,null,"z.B. Zuständige kantonale Stelle(n) und wichtigste Umsetzungspartner / Partner mit Leistungsverträgen",null,null,null,null,null,null,null,"z.B. Zuständige kantonale Stelle(n) und wichtigste Umsetzungspartner / Partner mit Leistungsverträgen",null,null,null,null,null,null,null,"z.B. Zuständige kantonale Stelle(n) und wichtigste Umsetzungspartner / Partner mit Leistungsverträgen",null,null,null,null,null,null,null,"z.B. Zuständige kantonale Stelle(n) und wichtigste Umsetzungspartner / Partner mit Leistungsverträgen",null,null,null,null,null,null,null,"z.B. Zuständige kantonale Stelle(n) und wichtigste Umsetzungspartner / Partner mit Leistungsverträgen",null,null,null,null,null,null,null,"z.B. Zuständige kantonale Stelle(n) und wichtigste Umsetzungspartner / Partner mit Leistungsverträgen",null,null,null,null,null,null,null,"z.B. Zuständige kantonale Stelle(n) und wichtigste Umsetzungspartner / Partner mit Leistungsverträgen",null,null,null,null,null,null,null,"z.B. Zuständige kantonale Stelle(n) und wichtigste Umsetzungspartner / Partner mit Leistungsverträgen",null,null,null,null,null,null,null,"z.B. Zuständige kantonale Stelle(n) und wichtigste Umsetzungspartner / Partner mit Leistungsverträgen",null,null,null,null,null,null,null,"z.B. Zuständige kantonale Stelle(n) und wichtigste Umsetzungspartner / Partner mit Leistungsverträgen",null,null,null,null,null,null,null,"z.B. Zuständige kantonale Stelle(n) und wichtigste Umsetzungspartner / Partner mit Leistungsverträgen",null,null,null,null,null,null,null,"z.B. Zuständige kantonale Stelle(n) und wichtigste Umsetzungspartner / Partner mit Leistungsverträgen",null,null,null,null,null,null,null,"z.B. Zuständige kantonale Stelle(n) und wichtigste Umsetzungspartner / Partner mit Leistungsverträgen",null,null,null,null,null,null,null,"z.B. Zuständige kantonale Stelle(n) und wichtigste Umsetzungspartner / Partner mit Leistungsverträgen",null,null,null,null,null,null,null,"z.B. Zuständige kantonale Stelle(n) und wichtigste Umsetzungspartner / Partner mit Leistungsverträgen",null,null,null,null,null,null,null,"z.B. Zuständige kantonale Stelle(n) und wichtigste Umsetzungspartner / Partner mit Leistungsverträgen",null,null,null,null,null,null,null,"z.B. Zuständige kantonale Stelle(n) und wichtigste Umsetzungspartner / Partner mit Leistungsverträgen",null,null,null,null,null,null,null,"z.B. Zuständige kantonale Stelle(n) und wichtigste Umsetzungspartner / Partner mit Leistungsverträgen",null,null,null,null,null,null,null,"z.B. Zuständige kantonale Stelle(n) und wichtigste Umsetzungspartner / Partner mit Leistungsverträgen",null,null,null,null,null,null,null,"z.B. Zuständige kantonale Stelle(n) und wichtigste Umsetzungspartner / Partner mit Leistungsverträgen",null,null,null,null,null,null,null,"z.B. Zuständige kantonale Stelle(n) und wichtigste Umsetzungspartner / Partner mit Leistungsverträgen",null,null,null,null,null,null,null,"z.B. Zuständige kantonale Stelle(n) und wichtigste Umsetzungspartner / Partner mit Leistungsverträgen",null,null,null,null,null,null,null,"z.B. Zuständige kantonale Stelle(n) und wichtigste Umsetzungspartner / Partner mit Leistungsverträgen",null,null,null,null,null,null,null,"z.B. Zuständige kantonale Stelle(n) und wichtigste Umsetzungspartner / Partner mit Leistungsverträgen",null,null,null,null,null,null,null,"z.B. Zuständige kantonale Stelle(n) und wichtigste Umsetzungspartner / Partner mit Leistungsverträgen",null,null,null,null,null,null,null,"z.B. Zuständige kantonale Stelle(n) und wichtigste Umsetzungspartner / Partner mit Leistungsverträgen",null,null,null,null,null,null,null,"z.B. Zuständige kantonale Stelle(n) und wichtigste Umsetzungspartner / Partner mit Leistungsverträgen",null,null,null,null,null,null,null,"z.B. Zuständige kantonale Stelle(n) und wichtigste Umsetzungspartner / Partner mit Leistungsverträgen",null,null,null,null,null,null,null,"z.B. Zuständige kantonale Stelle(n) und wichtigste Umsetzungspartner / Partner mit Leistungsverträgen",null,null,null,null,null,null,null,"z.B. Zuständige kantonale Stelle(n) und wichtigste Umsetzungspartner / Partner mit Leistungsverträgen",null,null,null,null,null,null,null,"z.B. Zuständige kantonale Stelle(n) und wichtigste Umsetzungspartner / Partner mit Leistungsverträgen",null,null,null,null,null,null,null,"z.B. Zuständige kantonale Stelle(n) und wichtigste Umsetzungspartner / Partner mit Leistungsverträgen",null,null,null,null,null,null,null,"z.B. Zuständige kantonale Stelle(n) und wichtigste Umsetzungspartner / Partner mit Leistungsverträgen",null,null,null,null,null,null,null,"z.B. Zuständige kantonale Stelle(n) und wichtigste Umsetzungspartner / Partner mit Leistungsverträgen",null,null,null,null,null,null,null,"z.B. Zuständige kantonale Stelle(n) und wichtigste Umsetzungspartner / Partner mit Leistungsverträgen",null,null,null,null,null,null,null,"z.B. Zuständige kantonale Stelle(n) und wichtigste Umsetzungspartner / Partner mit Leistungsverträgen",null,null,null,null,null,null,null,"z.B. Zuständige kantonale Stelle(n) und wichtigste Umsetzungspartner / Partner mit Leistungsverträgen",null,null,null,null,null,null,null,"z.B. Zuständige kantonale Stelle(n) und wichtigste Umsetzungspartner / Partner mit Leistungsverträgen",null,null,null,null,null,null,null,"z.B. Zuständige kantonale Stelle(n) und wichtigste Umsetzungspartner / Partner mit Leistungsverträgen",null,null,null,null,null,null,null,"z.B. Zuständige kantonale Stelle(n) und wichtigste Umsetzungspartner / Partner mit Leistungsverträgen",null,null,null,null,null,null,null,"z.B. Zuständige kantonale Stelle(n) und wichtigste Umsetzungspartner / Partner mit Leistungsverträgen",null,null,null,null,null,null,null,"z.B. Zuständige kantonale Stelle(n) und wichtigste Umsetzungspartner / Partner mit Leistungsverträgen",null,null,null,null,null,null,null,"z.B. Zuständige kantonale Stelle(n) und wichtigste Umsetzungspartner / Partner mit Leistungsverträgen",null,null,null,null,null,null,null,"z.B. Zuständige kantonale Stelle(n) und wichtigste Umsetzungspartner / Partner mit Leistungsverträgen",null,null,null,null,null,null,null,"z.B. Zuständige kantonale Stelle(n) und wichtigste Umsetzungspartner / Partner mit Leistungsverträgen",null,null,null,null,null,null,null,"z.B. Zuständige kantonale Stelle(n) und wichtigste Umsetzungspartner / Partner mit Leistungsverträgen",null,null,null,null,null,null,null,"z.B. Zuständige kantonale Stelle(n) und wichtigste Umsetzungspartner / Partner mit Leistungsverträgen",null,null,null,null,null,null,null,"z.B. Zuständige kantonale Stelle(n) und wichtigste Umsetzungspartner / Partner mit Leistungsverträgen",null,null,null,null,null,null,null,"z.B. Zuständige kantonale Stelle(n) und wichtigste Umsetzungspartner / Partner mit Leistungsverträgen",null,null,null,null,null,null,null,"z.B. Zuständige kantonale Stelle(n) und wichtigste Umsetzungspartner / Partner mit Leistungsverträgen",null,null,null,null,null,null,null,"z.B. Zuständige kantonale Stelle(n) und wichtigste Umsetzungspartner / Partner mit Leistungsverträgen",null,null,null,null,null,null,null,"z.B. Zuständige kantonale Stelle(n) und wichtigste Umsetzungspartner / Partner mit Leistungsverträgen",null,null,null,null,null,null,null,"z.B. Zuständige kantonale Stelle(n) und wichtigste Umsetzungspartner / Partner mit Leistungsverträgen",null,null,null,null,null,null,null,"z.B. Zuständige kantonale Stelle(n) und wichtigste Umsetzungspartner / Partner mit Leistungsverträgen",null,null,null,null,null,null,null,"z.B. Zuständige kantonale Stelle(n) und wichtigste Umsetzungspartner / Partner mit Leistungsverträgen",null,null,null,null,null,null,null,"z.B. Zuständige kantonale Stelle(n) und wichtigste Umsetzungspartner / Partner mit Leistungsverträgen",null,null,null,null,null,null,null,"z.B. Zuständige kantonale Stelle(n) und wichtigste Umsetzungspartner / Partner mit Leistungsverträgen",null,null,null,null,null,null,null,"z.B. Zuständige kantonale Stelle(n) und wichtigste Umsetzungspartner / Partner mit Leistungsverträgen",null,null,null,null,null,null,null,"z.B. Zuständige kantonale Stelle(n) und wichtigste Umsetzungspartner / Partner mit Leistungsverträgen",null,null,null,null,null,null,null,"z.B. Zuständige kantonale Stelle(n) und wichtigste Umsetzungspartner / Partner mit Leistungsverträgen",null,null,null,null,null,null,null,"z.B. Zuständige kantonale Stelle(n) und wichtigste Umsetzungspartner / Partner mit Leistungsverträgen",null,null,null,null,null,null,null,"z.B. Zuständige kantonale Stelle(n) und wichtigste Umsetzungspartner / Partner mit Leistungsverträgen",null,null,null,null,null,null,null,"z.B. Zuständige kantonale Stelle(n) und wichtigste Umsetzungspartner / Partner mit Leistungsverträgen",null,null,null,null,null,null,null,"z.B. Zuständige kantonale Stelle(n) und wichtigste Umsetzungspartner / Partner mit Leistungsverträgen",null,null,null,null,null,null,null,"z.B. Zuständige kantonale Stelle(n) und wichtigste Umsetzungspartner / Partner mit Leistungsverträgen",null,null,null,null,null,null,null,"z.B. Zuständige kantonale Stelle(n) und wichtigste Umsetzungspartner / Partner mit Leistungsverträgen",null,null,null,null,null,null,null,"z.B. Zuständige kantonale Stelle(n) und wichtigste Umsetzungspartner / Partner mit Leistungsverträgen",null,null,null,null,null,null,null,"z.B. Zuständige kantonale Stelle(n) und wichtigste Umsetzungspartner / Partner mit Leistungsverträgen",null,null,null,null,null,null,null,"z.B. Zuständige kantonale Stelle(n) und wichtigste Umsetzungspartner / Partner mit Leistungsverträgen",null,null,null,null,null,null,null,"z.B. Zuständige kantonale Stelle(n) und wichtigste Umsetzungspartner / Partner mit Leistungsverträgen",null,null,null,null,null,null,null,"z.B. Zuständige kantonale Stelle(n) und wichtigste Umsetzungspartner / Partner mit Leistungsverträgen",null,null,null,null,null,null,null,"z.B. Zuständige kantonale Stelle(n) und wichtigste Umsetzungspartner / Partner mit Leistungsverträgen",null,null,null,null,null,null,null,"z.B. Zuständige kantonale Stelle(n) und wichtigste Umsetzungspartner / Partner mit Leistungsverträgen",null,null,null,null,null,null,null,"z.B. Zuständige kantonale Stelle(n) und wichtigste Umsetzungspartner / Partner mit Leistungsverträgen",null,null,null,null,null,null,null,"z.B. Zuständige kantonale Stelle(n) und wichtigste Umsetzungspartner / Partner mit Leistungsverträgen",null,null,null,null,null,null,null,"z.B. Zuständige kantonale Stelle(n) und wichtigste Umsetzungspartner / Partner mit Leistungsverträgen",null,null,null,null,null,null,null,"z.B. Zuständige kantonale Stelle(n) und wichtigste Umsetzungspartner / Partner mit Leistungsverträgen",null,null,null,null,null,null,null,"z.B. Zuständige kantonale Stelle(n) und wichtigste Umsetzungspartner / Partner mit Leistungsverträgen",null,null,null,null,null,null,null,"z.B. Zuständige kantonale Stelle(n) und wichtigste Umsetzungspartner / Partner mit Leistungsverträgen",null,null,null,null,null,null,null,"z.B. Zuständige kantonale Stelle(n) und wichtigste Umsetzungspartner / Partner mit Leistungsverträgen",null,null,null,null,null,null,null,"z.B. Zuständige kantonale Stelle(n) und wichtigste Umsetzungspartner / Partner mit Leistungsverträgen",null,null,null,null,null,null,null,"z.B. Zuständige kantonale Stelle(n) und wichtigste Umsetzungspartner / Partner mit Leistungsverträgen",null,null,null,null,null,null,null,"z.B. Zuständige kantonale Stelle(n) und wichtigste Umsetzungspartner / Partner mit Leistungsverträgen",null,null,null,null,null,null,null,"z.B. Zuständige kantonale Stelle(n) und wichtigste Umsetzungspartner / Partner mit Leistungsverträgen",null,null,null,null,null,null,null,"z.B. Zuständige kantonale Stelle(n) und wichtigste Umsetzungspartner / Partner mit Leistungsverträgen",null,null,null,null,null,null,null,"z.B. Zuständige kantonale Stelle(n) und wichtigste Umsetzungspartner / Partner mit Leistungsverträgen",null,null,null,null,null,null,null,"z.B. Zuständige kantonale Stelle(n) und wichtigste Umsetzungspartner / Partner mit Leistungsverträgen",null,null,null,null,null,null,null,"z.B. Zuständige kantonale Stelle(n) und wichtigste Umsetzungspartner / Partner mit Leistungsverträgen",null,null,null,null,null,null,null,"z.B. Zuständige kantonale Stelle(n) und wichtigste Umsetzungspartner / Partner mit Leistungsverträgen",null,null,null,null,null,null,null,"z.B. Zuständige kantonale Stelle(n) und wichtigste Umsetzungspartner / Partner mit Leistungsverträgen",null,null,null,null,null,null,null,"z.B. Zuständige kantonale Stelle(n) und wichtigste Umsetzungspartner / Partner mit Leistungsverträgen",null,null,null,null,null,null,null,"z.B. Zuständige kantonale Stelle(n) und wichtigste Umsetzungspartner / Partner mit Leistungsverträgen",null,null,null,null,null,null,null,"z.B. Zuständige kantonale Stelle(n) und wichtigste Umsetzungspartner / Partner mit Leistungsverträgen",null,null,null,null,null,null,null,"z.B. Zuständige kantonale Stelle(n) und wichtigste Umsetzungspartner / Partner mit Leistungsverträgen",null,null,null,null,null,null,null,"z.B. Zuständige kantonale Stelle(n) und wichtigste Umsetzungspartner / Partner mit Leistungsverträgen",null,null,null,null,null,null,null,"z.B. Zuständige kantonale Stelle(n) und wichtigste Umsetzungspartner / Partner mit Leistungsverträgen",null,null,null,null,null,null,null,"z.B. Zuständige kantonale Stelle(n) und wichtigste Umsetzungspartner / Partner mit Leistungsverträgen",null,null,null,null,null,null,null,"z.B. Zuständige kantonale Stelle(n) und wichtigste Umsetzungspartner / Partner mit Leistungsverträgen",null,null,null,null,null,null,null,"z.B. Zuständige kantonale Stelle(n) und wichtigste Umsetzungspartner / Partner mit Leistungsverträgen",null,null,null,null,null,null,null,"z.B. Zuständige kantonale Stelle(n) und wichtigste Umsetzungspartner / Partner mit Leistungsverträgen",null,null,null,null,null,null,null,"z.B. Zuständige kantonale Stelle(n) und wichtigste Umsetzungspartner / Partner mit Leistungsverträgen",null,null,null,null,null,null,null,"z.B. Zuständige kantonale Stelle(n) und wichtigste Umsetzungspartner / Partner mit Leistungsverträgen",null,null,null,null,null,null,null,"z.B. Zuständige kantonale Stelle(n) und wichtigste Umsetzungspartner / Partner mit Leistungsverträgen",null,null,null,null,null,null,null,"z.B. Zuständige kantonale Stelle(n) und wichtigste Umsetzungspartner / Partner mit Leistungsverträgen",null,null,null,null,null,null,null,"z.B. Zuständige kantonale Stelle(n) und wichtigste Umsetzungspartner / Partner mit Leistungsverträgen",null,null,null,null,null,null,null,"z.B. Zuständige kantonale Stelle(n) und wichtigste Umsetzungspartner / Partner mit Leistungsverträgen",null,null,null,null,null,null,null,"z.B. Zuständige kantonale Stelle(n) und wichtigste Umsetzungspartner / Partner mit Leistungsverträgen",null,null,null,null,null,null,null,"z.B. Zuständige kantonale Stelle(n) und wichtigste Umsetzungspartner / Partner mit Leistungsverträgen",null,null,null,null,null,null,null,"z.B. Zuständige kantonale Stelle(n) und wichtigste Umsetzungspartner / Partner mit Leistungsverträgen",null,null,null,null,null,null,null,"z.B. Zuständige kantonale Stelle(n) und wichtigste Umsetzungspartner / Partner mit Leistungsverträgen",null,null,null,null,null,null,null,"z.B. Zuständige kantonale Stelle(n) und wichtigste Umsetzungspartner / Partner mit Leistungsverträgen",null,null,null,null,null,null,null,"z.B. Zuständige kantonale Stelle(n) und wichtigste Umsetzungspartner / Partner mit Leistungsverträgen",null,null,null,null,null,null,null,"z.B. Zuständige kantonale Stelle(n) und wichtigste Umsetzungspartner / Partner mit Leistungsverträgen",null,null,null,null,null,null,null,"z.B. Zuständige kantonale Stelle(n) und wichtigste Umsetzungspartner / Partner mit Leistungsverträgen",null,null,null,null,null,null,null,"z.B. Zuständige kantonale Stelle(n) und wichtigste Umsetzungspartner / Partner mit Leistungsverträgen",null,null,null,null,null,null,null,"z.B. Zuständige kantonale Stelle(n) und wichtigste Umsetzungspartner / Partner mit Leistungsverträgen",null,null,null,null,null,null,null,"z.B. Zuständige kantonale Stelle(n) und wichtigste Umsetzungspartner / Partner mit Leistungsverträgen",null,null,null,null,null,null,null,"z.B. Zuständige kantonale Stelle(n) und wichtigste Umsetzungspartner / Partner mit Leistungsverträgen",null,null,null,null,null,null,null,"z.B. Zuständige kantonale Stelle(n) und wichtigste Umsetzungspartner / Partner mit Leistungsverträgen",null,null,null,null,null,null,null,"z.B. Zuständige kantonale Stelle(n) und wichtigste Umsetzungspartner / Partner mit Leistungsverträgen",null,null,null,null,null,null,null,"z.B. Zuständige kantonale Stelle(n) und wichtigste Umsetzungspartner / Partner mit Leistungsverträgen",null,null,null,null,null,null,null,"z.B. Zuständige kantonale Stelle(n) und wichtigste Umsetzungspartner / Partner mit Leistungsverträgen",null,null,null,null,null,null,null,"z.B. Zuständige kantonale Stelle(n) und wichtigste Umsetzungspartner / Partner mit Leistungsverträgen",null,null,null,null,null,null,null,"z.B. Zuständige kantonale Stelle(n) und wichtigste Umsetzungspartner / Partner mit Leistungsverträgen",null,null,null,null,null,null,null,"z.B. Zuständige kantonale Stelle(n) und wichtigste Umsetzungspartner / Partner mit Leistungsverträgen",null,null,null,null,null,null,null,"z.B. Zuständige kantonale Stelle(n) und wichtigste Umsetzungspartner / Partner mit Leistungsverträgen",null,null,null,null,null,null,null,"z.B. Zuständige kantonale Stelle(n) und wichtigste Umsetzungspartner / Partner mit Leistungsverträgen",null,null,null,null,null,null,null,"z.B. Zuständige kantonale Stelle(n) und wichtigste Umsetzungspartner / Partner mit Leistungsverträgen",null,null,null,null,null,null,null,"z.B. Zuständige kantonale Stelle(n) und wichtigste Umsetzungspartner / Partner mit Leistungsverträgen",null,null,null,null,null,null,null,"z.B. Zuständige kantonale Stelle(n) und wichtigste Umsetzungspartner / Partner mit Leistungsverträgen",null,null,null,null,null,null,null,"z.B. Zuständige kantonale Stelle(n) und wichtigste Umsetzungspartner / Partner mit Leistungsverträgen",null,null,null,null,null,null,null,"z.B. Zuständige kantonale Stelle(n) und wichtigste Umsetzungspartner / Partner mit Leistungsverträgen",null,null,null,null,null,null,null,"z.B. Zuständige kantonale Stelle(n) und wichtigste Umsetzungspartner / Partner mit Leistungsverträgen",null,null,null,null,null,null,null,"z.B. Zuständige kantonale Stelle(n) und wichtigste Umsetzungspartner / Partner mit Leistungsverträgen",null,null,null,null,null,null,null,"z.B. Zuständige kantonale Stelle(n) und wichtigste Umsetzungspartner / Partner mit Leistungsverträgen",null,null,null,null,null,null,null,"z.B. Zuständige kantonale Stelle(n) und wichtigste Umsetzungspartner / Partner mit Leistungsverträgen",null,null,null,null,null,null,null,"z.B. Zuständige kantonale Stelle(n) und wichtigste Umsetzungspartner / Partner mit Leistungsverträgen",null,null,null,null,null,null,null,"z.B. Zuständige kantonale Stelle(n) und wichtigste Umsetzungspartner / Partner mit Leistungsverträgen",null,null,null,null,null,null,null,"z.B. Zuständige kantonale Stelle(n) und wichtigste Umsetzungspartner / Partner mit Leistungsverträgen",null,null,null,null,null,null,null,"z.B. Zuständige kantonale Stelle(n) und wichtigste Umsetzungspartner / Partner mit Leistungsverträgen",null,null,null,null,null,null,null,"z.B. Zuständige kantonale Stelle(n) und wichtigste Umsetzungspartner / Partner mit Leistungsverträgen",null,null,null,null,null,null,null,"z.B. Zuständige kantonale Stelle(n) und wichtigste Umsetzungspartner / Partner mit Leistungsverträgen",null,null,null,null,null,null,null,"z.B. Zuständige kantonale Stelle(n) und wichtigste Umsetzungspartner / Partner mit Leistungsverträgen",null,null,null,null,null,null,null,"z.B. Zuständige kantonale Stelle(n) und wichtigste Umsetzungspartner / Partner mit Leistungsverträgen",null,null,null,null,null,null,null,"z.B. Zuständige kantonale Stelle(n) und wichtigste Umsetzungspartner / Partner mit Leistungsverträgen",null,null,null,null,null,null,null,"z.B. Zuständige kantonale Stelle(n) und wichtigste Umsetzungspartner / Partner mit Leistungsverträgen",null,null,null,null,null,null,null,"z.B. Zuständige kantonale Stelle(n) und wichtigste Umsetzungspartner / Partner mit Leistungsverträgen",null,null,null,null,null,null,null,"z.B. Zuständige kantonale Stelle(n) und wichtigste Umsetzungspartner / Partner mit Leistungsverträgen",null,null,null,null,null,null,null,"z.B. Zuständige kantonale Stelle(n) und wichtigste Umsetzungspartner / Partner mit Leistungsverträgen",null,null,null,null,null,null,null,"z.B. Zuständige kantonale Stelle(n) und wichtigste Umsetzungspartner / Partner mit Leistungsverträgen",null,null,null,null,null,null,null,"z.B. Zuständige kantonale Stelle(n) und wichtigste Umsetzungspartner / Partner mit Leistungsverträgen",null,null,null,null,null,null,null,"z.B. Zuständige kantonale Stelle(n) und wichtigste Umsetzungspartner / Partner mit Leistungsverträgen",null,null,null,null,null,null,null,"z.B. Zuständige kantonale Stelle(n) und wichtigste Umsetzungspartner / Partner mit Leistungsverträgen",null,null,null,null,null,null,null,"z.B. Zuständige kantonale Stelle(n) und wichtigste Umsetzungspartner / Partner mit Leistungsverträgen",null,null,null,null,null,null,null,"z.B. Zuständige kantonale Stelle(n) und wichtigste Umsetzungspartner / Partner mit Leistungsverträgen",null,null,null,null,null,null,null,"z.B. Zuständige kantonale Stelle(n) und wichtigste Umsetzungspartner / Partner mit Leistungsverträgen",null,null,null,null,null,null,null,"z.B. Zuständige kantonale Stelle(n) und wichtigste Umsetzungspartner / Partner mit Leistungsverträgen",null,null,null,null,null,null,null,"z.B. Zuständige kantonale Stelle(n) und wichtigste Umsetzungspartner / Partner mit Leistungsverträgen",null,null,null,null,null,null,null,"z.B. Zuständige kantonale Stelle(n) und wichtigste Umsetzungspartner / Partner mit Leistungsverträgen",null,null,null,null,null,null,null,"z.B. Zuständige kantonale Stelle(n) und wichtigste Umsetzungspartner / Partner mit Leistungsverträgen",null,null,null,null,null,null,null,"z.B. Zuständige kantonale Stelle(n) und wichtigste Umsetzungspartner / Partner mit Leistungsverträgen",null,null,null,null,null,null,null,"z.B. Zuständige kantonale Stelle(n) und wichtigste Umsetzungspartner / Partner mit Leistungsverträgen",null,null,null,null,null,null,null,"z.B. Zuständige kantonale Stelle(n) und wichtigste Umsetzungspartner / Partner mit Leistungsverträgen",null,null,null,null,null,null,null,"z.B. Zuständige kantonale Stelle(n) und wichtigste Umsetzungspartner / Partner mit Leistungsverträgen",null,null,null,null,null,null,null,"z.B. Zuständige kantonale Stelle(n) und wichtigste Umsetzungspartner / Partner mit Leistungsverträgen",null,null,null,null,null,null,null,"z.B. Zuständige kantonale Stelle(n) und wichtigste Umsetzungspartner / Partner mit Leistungsverträgen",null,null,null,null,null,null,null,"z.B. Zuständige kantonale Stelle(n) und wichtigste Umsetzungspartner / Partner mit Leistungsverträgen",null,null,null,null,null,null,null,"z.B. Zuständige kantonale Stelle(n) und wichtigste Umsetzungspartner / Partner mit Leistungsverträgen",null,null,null,null,null,null,null,"z.B. Zuständige kantonale Stelle(n) und wichtigste Umsetzungspartner / Partner mit Leistungsverträgen",null,null,null,null,null,null,null,"z.B. Zuständige kantonale Stelle(n) und wichtigste Umsetzungspartner / Partner mit Leistungsverträgen",null,null,null,null,null,null,null,"z.B. Zuständige kantonale Stelle(n) und wichtigste Umsetzungspartner / Partner mit Leistungsverträgen",null,null,null,null,null,null,null,"z.B. Zuständige kantonale Stelle(n) und wichtigste Umsetzungspartner / Partner mit Leistungsverträgen",null,null,null,null,null,null,null,"z.B. Zuständige kantonale Stelle(n) und wichtigste Umsetzungspartner / Partner mit Leistungsverträgen",null,null,null,null,null,null,null,"z.B. Zuständige kantonale Stelle(n) und wichtigste Umsetzungspartner / Partner mit Leistungsverträgen",null,null,null,null,null,null,null,"z.B. Zuständige kantonale Stelle(n) und wichtigste Umsetzungspartner / Partner mit Leistungsverträgen",null,null,null,null,null,null,null,"z.B. Zuständige kantonale Stelle(n) und wichtigste Umsetzungspartner / Partner mit Leistungsverträgen",null,null,null,null,null,null,null,"z.B. Zuständige kantonale Stelle(n) und wichtigste Umsetzungspartner / Partner mit Leistungsverträgen",null,null,null,null,null,null,null,"z.B. Zuständige kantonale Stelle(n) und wichtigste Umsetzungspartner / Partner mit Leistungsverträgen",null,null,null,null,null,null,null,"z.B. Zuständige kantonale Stelle(n) und wichtigste Umsetzungspartner / Partner mit Leistungsverträgen",null,null,null,null,null,null,null,"z.B. Zuständige kantonale Stelle(n) und wichtigste Umsetzungspartner / Partner mit Leistungsverträgen",null,null,null,null,null,null,null,"z.B. Zuständige kantonale Stelle(n) und wichtigste Umsetzungspartner / Partner mit Leistungsverträgen",null,null,null,null,null,null,null,"z.B. Zuständige kantonale Stelle(n) und wichtigste Umsetzungspartner / Partner mit Leistungsverträgen",null,null,null,null,null,null,null,"z.B. Zuständige kantonale Stelle(n) und wichtigste Umsetzungspartner / Partner mit Leistungsverträgen",null,null,null,null,null,null,null,"z.B. Zuständige kantonale Stelle(n) und wichtigste Umsetzungspartner / Partner mit Leistungsverträgen",null,null,null,null,null,null,null,"z.B. Zuständige kantonale Stelle(n) und wichtigste Umsetzungspartner / Partner mit Leistungsverträgen",null,null,null,null,null,null,null,"z.B. Zuständige kantonale Stelle(n) und wichtigste Umsetzungspartner / Partner mit Leistungsverträgen",null,null,null,null,null,null,null,"z.B. Zuständige kantonale Stelle(n) und wichtigste Umsetzungspartner / Partner mit Leistungsverträgen",null,null,null,null,null,null,null,"z.B. Zuständige kantonale Stelle(n) und wichtigste Umsetzungspartner / Partner mit Leistungsverträgen",null,null,null,null,null,null,null,"z.B. Zuständige kantonale Stelle(n) und wichtigste Umsetzungspartner / Partner mit Leistungsverträgen",null,null,null,null,null,null,null,"z.B. Zuständige kantonale Stelle(n) und wichtigste Umsetzungspartner / Partner mit Leistungsverträgen",null,null,null,null,null,null,null,"z.B. Zuständige kantonale Stelle(n) und wichtigste Umsetzungspartner / Partner mit Leistungsverträgen",null,null,null,null,null,null,null,"z.B. Zuständige kantonale Stelle(n) und wichtigste Umsetzungspartner / Partner mit Leistungsverträgen",null,null,null,null,null,null,null,"z.B. Zuständige kantonale Stelle(n) und wichtigste Umsetzungspartner / Partner mit Leistungsverträgen",null,null,null,null,null,null,null,"z.B. Zuständige kantonale Stelle(n) und wichtigste Umsetzungspartner / Partner mit Leistungsverträgen",null,null,null,null,null,null,null,"z.B. Zuständige kantonale Stelle(n) und wichtigste Umsetzungspartner / Partner mit Leistungsverträgen",null,null,null,null,null,null,null,"z.B. Zuständige kantonale Stelle(n) und wichtigste Umsetzungspartner / Partner mit Leistungsverträgen",null,null,null,null,null,null,null,"z.B. Zuständige kantonale Stelle(n) und wichtigste Umsetzungspartner / Partner mit Leistungsverträgen",null,null,null,null,null,null,null,"z.B. Zuständige kantonale Stelle(n) und wichtigste Umsetzungspartner / Partner mit Leistungsverträgen",null,null,null,null,null,null,null,"z.B. Zuständige kantonale Stelle(n) und wichtigste Umsetzungspartner / Partner mit Leistungsverträgen",null,null,null,null,null,null,null,"z.B. Zuständige kantonale Stelle(n) und wichtigste Umsetzungspartner / Partner mit Leistungsverträgen",null,null,null,null,null,null,null,"z.B. Zuständige kantonale Stelle(n) und wichtigste Umsetzungspartner / Partner mit Leistungsverträgen",null,null,null,null,null,null,null,"z.B. Zuständige kantonale Stelle(n) und wichtigste Umsetzungspartner / Partner mit Leistungsverträgen",null,null,null,null,null,null,null,"z.B. Zuständige kantonale Stelle(n) und wichtigste Umsetzungspartner / Partner mit Leistungsverträgen",null,null,null,null,null,null,null,"z.B. Zuständige kantonale Stelle(n) und wichtigste Umsetzungspartner / Partner mit Leistungsverträgen",null,null,null,null,null,null,null,"z.B. Zuständige kantonale Stelle(n) und wichtigste Umsetzungspartner / Partner mit Leistungsverträgen",null,null,null,null,null,null,null,"z.B. Zuständige kantonale Stelle(n) und wichtigste Umsetzungspartner / Partner mit Leistungsverträgen",null,null,null,null,null,null,null,"z.B. Zuständige kantonale Stelle(n) und wichtigste Umsetzungspartner / Partner mit Leistungsverträgen",null,null,null,null,null,null,null,"z.B. Zuständige kantonale Stelle(n) und wichtigste Umsetzungspartner / Partner mit Leistungsverträgen",null,null,null,null,null,null,null,"z.B. Zuständige kantonale Stelle(n) und wichtigste Umsetzungspartner / Partner mit Leistungsverträgen",null,null,null,null,null,null,null,"z.B. Zuständige kantonale Stelle(n) und wichtigste Umsetzungspartner / Partner mit Leistungsverträgen",null,null,null,null,null,null,null,"z.B. Zuständige kantonale Stelle(n) und wichtigste Umsetzungspartner / Partner mit Leistungsverträgen",null,null,null,null,null,null,null,"z.B. Zuständige kantonale Stelle(n) und wichtigste Umsetzungspartner / Partner mit Leistungsverträgen",null,null,null,null,null,null,null,"z.B. Zuständige kantonale Stelle(n) und wichtigste Umsetzungspartner / Partner mit Leistungsverträgen",null,null,null,null,null,null,null,"z.B. Zuständige kantonale Stelle(n) und wichtigste Umsetzungspartner / Partner mit Leistungsverträgen",null,null,null,null,null,null,null,"z.B. Zuständige kantonale Stelle(n) und wichtigste Umsetzungspartner / Partner mit Leistungsverträgen",null,null,null,null,null,null,null,"z.B. Zuständige kantonale Stelle(n) und wichtigste Umsetzungspartner / Partner mit Leistungsverträgen",null,null,null,null,null,null,null,"z.B. Zuständige kantonale Stelle(n) und wichtigste Umsetzungspartner / Partner mit Leistungsverträgen",null,null,null,null,null,null,null,"z.B. Zuständige kantonale Stelle(n) und wichtigste Umsetzungspartner / Partner mit Leistungsverträgen",null,null,null,null,null,null,null,"z.B. Zuständige kantonale Stelle(n) und wichtigste Umsetzungspartner / Partner mit Leistungsverträgen",null,null,null,null,null,null,null,"z.B. Zuständige kantonale Stelle(n) und wichtigste Umsetzungspartner / Partner mit Leistungsverträgen",null,null,null,null,null,null,null,"z.B. Zuständige kantonale Stelle(n) und wichtigste Umsetzungspartner / Partner mit Leistungsverträgen",null,null,null,null,null,null,null,"z.B. Zuständige kantonale Stelle(n) und wichtigste Umsetzungspartner / Partner mit Leistungsverträgen",null,null,null,null,null,null,null,"z.B. Zuständige kantonale Stelle(n) und wichtigste Umsetzungspartner / Partner mit Leistungsverträgen",null,null,null,null,null,null,null,"z.B. Zuständige kantonale Stelle(n) und wichtigste Umsetzungspartner / Partner mit Leistungsverträgen",null,null,null,null,null,null,null,"z.B. Zuständige kantonale Stelle(n) und wichtigste Umsetzungspartner / Partner mit Leistungsverträgen",null,null,null,null,null,null,null,"z.B. Zuständige kantonale Stelle(n) und wichtigste Umsetzungspartner / Partner mit Leistungsverträgen",null,null,null,null,null,null,null,"z.B. Zuständige kantonale Stelle(n) und wichtigste Umsetzungspartner / Partner mit Leistungsverträgen",null,null,null,null,null,null,null,"z.B. Zuständige kantonale Stelle(n) und wichtigste Umsetzungspartner / Partner mit Leistungsverträgen",null,null,null,null,null,null,null,"z.B. Zuständige kantonale Stelle(n) und wichtigste Umsetzungspartner / Partner mit Leistungsverträgen",null,null,null,null,null,null,null,"z.B. Zuständige kantonale Stelle(n) und wichtigste Umsetzungspartner / Partner mit Leistungsverträgen",null,null,null,null,null,null,null,"z.B. Zuständige kantonale Stelle(n) und wichtigste Umsetzungspartner / Partner mit Leistungsverträgen",null,null,null,null,null,null,null,"z.B. Zuständige kantonale Stelle(n) und wichtigste Umsetzungspartner / Partner mit Leistungsverträgen",null,null,null,null,null,null,null,"z.B. Zuständige kantonale Stelle(n) und wichtigste Umsetzungspartner / Partner mit Leistungsverträgen",null,null,null,null,null,null,null,"z.B. Zuständige kantonale Stelle(n) und wichtigste Umsetzungspartner / Partner mit Leistungsverträgen",null,null,null,null,null,null,null,"z.B. Zuständige kantonale Stelle(n) und wichtigste Umsetzungspartner / Partner mit Leistungsverträgen",null,null,null,null,null,null,null,"z.B. Zuständige kantonale Stelle(n) und wichtigste Umsetzungspartner / Partner mit Leistungsverträgen",null,null,null,null,null,null,null,"z.B. Zuständige kantonale Stelle(n) und wichtigste Umsetzungspartner / Partner mit Leistungsverträgen",null,null,null,null,null,null,null,"z.B. Zuständige kantonale Stelle(n) und wichtigste Umsetzungspartner / Partner mit Leistungsverträgen",null,null,null,null,null,null,null,"z.B. Zuständige kantonale Stelle(n) und wichtigste Umsetzungspartner / Partner mit Leistungsverträgen",null,null,null,null,null,null,null,"z.B. Zuständige kantonale Stelle(n) und wichtigste Umsetzungspartner / Partner mit Leistungsverträgen",null,null,null,null,null,null,null,"z.B. Zuständige kantonale Stelle(n) und wichtigste Umsetzungspartner / Partner mit Leistungsverträgen",null,null,null,null,null,null,null,"z.B. Zuständige kantonale Stelle(n) und wichtigste Umsetzungspartner / Partner mit Leistungsverträgen",null,null,null,null,null,null,null,"z.B. Zuständige kantonale Stelle(n) und wichtigste Umsetzungspartner / Partner mit Leistungsverträgen",null,null,null,null,null,null,null,"z.B. Zuständige kantonale Stelle(n) und wichtigste Umsetzungspartner / Partner mit Leistungsverträgen",null,null,null,null,null,null,null,"z.B. Zuständige kantonale Stelle(n) und wichtigste Umsetzungspartner / Partner mit Leistungsverträgen",null,null,null,null,null,null,null,"z.B. Zuständige kantonale Stelle(n) und wichtigste Umsetzungspartner / Partner mit Leistungsverträgen",null,null,null,null,null,null,null,"z.B. Zuständige kantonale Stelle(n) und wichtigste Umsetzungspartner / Partner mit Leistungsverträgen",null,null,null,null,null,null,null,"z.B. Zuständige kantonale Stelle(n) und wichtigste Umsetzungspartner / Partner mit Leistungsverträgen",null,null,null,null,null,null,null,"z.B. Zuständige kantonale Stelle(n) und wichtigste Umsetzungspartner / Partner mit Leistungsverträgen",null,null,null,null,null,null,null,"z.B. Zuständige kantonale Stelle(n) und wichtigste Umsetzungspartner / Partner mit Leistungsverträgen",null,null,null,null,null,null,null,"z.B. Zuständige kantonale Stelle(n) und wichtigste Umsetzungspartner / Partner mit Leistungsverträgen",null,null,null,null,null,null,null,"z.B. Zuständige kantonale Stelle(n) und wichtigste Umsetzungspartner / Partner mit Leistungsverträgen",null,null,null,null,null,null,null,"z.B. Zuständige kantonale Stelle(n) und wichtigste Umsetzungspartner / Partner mit Leistungsverträgen",null,null,null,null,null,null,null,"z.B. Zuständige kantonale Stelle(n) und wichtigste Umsetzungspartner / Partner mit Leistungsverträgen",null,null,null,null,null,null,null,"z.B. Zuständige kantonale Stelle(n) und wichtigste Umsetzungspartner / Partner mit Leistungsverträgen",null,null,null,null,null,null,null,"z.B. Zuständige kantonale Stelle(n) und wichtigste Umsetzungspartner / Partner mit Leistungsverträgen",null,null,null,null,null,null,null,"z.B. Zuständige kantonale Stelle(n) und wichtigste Umsetzungspartner / Partner mit Leistungsverträgen",null,null,null,null,null,null,null,"z.B. Zuständige kantonale Stelle(n) und wichtigste Umsetzungspartner / Partner mit Leistungsverträgen",null,null,null,null,null,null,null,"z.B. Zuständige kantonale Stelle(n) und wichtigste Umsetzungspartner / Partner mit Leistungsverträgen",null,null,null,null,null,null,null,"z.B. Zuständige kantonale Stelle(n) und wichtigste Umsetzungspartner / Partner mit Leistungsverträgen",null,null,null,null,null,null,null,"z.B. Zuständige kantonale Stelle(n) und wichtigste Umsetzungspartner / Partner mit Leistungsverträgen",null,null,null,null,null,null,null,"z.B. Zuständige kantonale Stelle(n) und wichtigste Umsetzungspartner / Partner mit Leistungsverträgen",null,null,null,null,null,null,null,"z.B. Zuständige kantonale Stelle(n) und wichtigste Umsetzungspartner / Partner mit Leistungsverträgen",null,null,null,null,null,null,null,"z.B. Zuständige kantonale Stelle(n) und wichtigste Umsetzungspartner / Partner mit Leistungsverträgen",null,null,null,null,null,null,null,"z.B. Zuständige kantonale Stelle(n) und wichtigste Umsetzungspartner / Partner mit Leistungsverträgen",null,null,null,null,null,null,null,"z.B. Zuständige kantonale Stelle(n) und wichtigste Umsetzungspartner / Partner mit Leistungsverträgen",null,null,null,null,null,null,null,"z.B. Zuständige kantonale Stelle(n) und wichtigste Umsetzungspartner / Partner mit Leistungsverträgen",null,null,null,null,null,null,null,"z.B. Zuständige kantonale Stelle(n) und wichtigste Umsetzungspartner / Partner mit Leistungsverträgen",null,null,null,null,null,null,null,"z.B. Zuständige kantonale Stelle(n) und wichtigste Umsetzungspartner / Partner mit Leistungsverträgen",null,null,null,null,null,null,null,"z.B. Zuständige kantonale Stelle(n) und wichtigste Umsetzungspartner / Partner mit Leistungsverträgen",null,null,null,null,null,null,null,"z.B. Zuständige kantonale Stelle(n) und wichtigste Umsetzungspartner / Partner mit Leistungsverträgen",null,null,null,null,null,null,null,"z.B. Zuständige kantonale Stelle(n) und wichtigste Umsetzungspartner / Partner mit Leistungsverträgen",null,null,null,null,null,null,null,"z.B. Zuständige kantonale Stelle(n) und wichtigste Umsetzungspartner / Partner mit Leistungsverträgen",null,null,null,null,null,null,null,"z.B. Zuständige kantonale Stelle(n) und wichtigste Umsetzungspartner / Partner mit Leistungsverträgen",null,null,null,null,null,null,null,"z.B. Zuständige kantonale Stelle(n) und wichtigste Umsetzungspartner / Partner mit Leistungsverträgen",null,null,null,null,null,null,null,"z.B. Zuständige kantonale Stelle(n) und wichtigste Umsetzungspartner / Partner mit Leistungsverträgen",null,null,null,null,null,null,null,"z.B. Zuständige kantonale Stelle(n) und wichtigste Umsetzungspartner / Partner mit Leistungsverträgen",null,null,null,null,null,null,null,"z.B. Zuständige kantonale Stelle(n) und wichtigste Umsetzungspartner / Partner mit Leistungsverträgen",null,null,null,null,null,null,null,"z.B. Zuständige kantonale Stelle(n) und wichtigste Umsetzungspartner / Partner mit Leistungsverträgen",null,null,null,null,null,null,null,"z.B. Zuständige kantonale Stelle(n) und wichtigste Umsetzungspartner / Partner mit Leistungsverträgen",null,null,null,null,null,null,null,"z.B. Zuständige kantonale Stelle(n) und wichtigste Umsetzungspartner / Partner mit Leistungsverträgen",null,null,null,null,null,null,null,"z.B. Zuständige kantonale Stelle(n) und wichtigste Umsetzungspartner / Partner mit Leistungsverträgen",null,null,null,null,null,null,null,"z.B. Zuständige kantonale Stelle(n) und wichtigste Umsetzungspartner / Partner mit Leistungsverträgen",null,null,null,null,null,null,null,"z.B. Zuständige kantonale Stelle(n) und wichtigste Umsetzungspartner / Partner mit Leistungsverträgen",null,null,null,null,null,null,null,"z.B. Zuständige kantonale Stelle(n) und wichtigste Umsetzungspartner / Partner mit Leistungsverträgen",null,null,null,null,null,null,null,"z.B. Zuständige kantonale Stelle(n) und wichtigste Umsetzungspartner / Partner mit Leistungsverträgen",null,null,null,null,null,null,null,"z.B. Zuständige kantonale Stelle(n) und wichtigste Umsetzungspartner / Partner mit Leistungsverträgen",null,null,null,null,null,null,null,"z.B. Zuständige kantonale Stelle(n) und wichtigste Umsetzungspartner / Partner mit Leistungsverträgen",null,null,null,null,null,null,null,"z.B. Zuständige kantonale Stelle(n) und wichtigste Umsetzungspartner / Partner mit Leistungsverträgen",null,null,null,null,null,null,null,"z.B. Zuständige kantonale Stelle(n) und wichtigste Umsetzungspartner / Partner mit Leistungsverträgen",null,null,null,null,null,null,null,"z.B. Zuständige kantonale Stelle(n) und wichtigste Umsetzungspartner / Partner mit Leistungsverträgen",null,null,null,null,null,null,null,"z.B. Zuständige kantonale Stelle(n) und wichtigste Umsetzungspartner / Partner mit Leistungsverträgen",null,null,null,null,null,null,null,"z.B. Zuständige kantonale Stelle(n) und wichtigste Umsetzungspartner / Partner mit Leistungsverträgen",null,null,null,null,null,null,null,"z.B. Zuständige kantonale Stelle(n) und wichtigste Umsetzungspartner / Partner mit Leistungsverträgen",null,null,null,null,null,null,null,"z.B. Zuständige kantonale Stelle(n) und wichtigste Umsetzungspartner / Partner mit Leistungsverträgen",null,null,null,null,null,null,null,"z.B. Zuständige kantonale Stelle(n) und wichtigste Umsetzungspartner / Partner mit Leistungsverträgen",null,null,null,null,null,null,null,"z.B. Zuständige kantonale Stelle(n) und wichtigste Umsetzungspartner / Partner mit Leistungsverträgen",null,null,null,null,null,null,null,"z.B. Zuständige kantonale Stelle(n) und wichtigste Umsetzungspartner / Partner mit Leistungsverträgen",null,null,null,null,null,null,null,"z.B. Zuständige kantonale Stelle(n) und wichtigste Umsetzungspartner / Partner mit Leistungsverträgen",null,null,null,null,null,null,null,"z.B. Zuständige kantonale Stelle(n) und wichtigste Umsetzungspartner / Partner mit Leistungsverträgen",null,null,null,null,null,null,null,"z.B. Zuständige kantonale Stelle(n) und wichtigste Umsetzungspartner / Partner mit Leistungsverträgen",null,null,null,null,null,null,null,"z.B. Zuständige kantonale Stelle(n) und wichtigste Umsetzungspartner / Partner mit Leistungsverträgen",null,null,null,null,null,null,null,"z.B. Zuständige kantonale Stelle(n) und wichtigste Umsetzungspartner / Partner mit Leistungsverträgen",null,null,null,null,null,null,null,"z.B. Zuständige kantonale Stelle(n) und wichtigste Umsetzungspartner / Partner mit Leistungsverträgen",null,null,null,null,null,null,null,"z.B. Zuständige kantonale Stelle(n) und wichtigste Umsetzungspartner / Partner mit Leistungsverträgen",null,null,null,null,null,null,null,"z.B. Zuständige kantonale Stelle(n) und wichtigste Umsetzungspartner / Partner mit Leistungsverträgen",null,null,null,null,null,null,null,"z.B. Zuständige kantonale Stelle(n) und wichtigste Umsetzungspartner / Partner mit Leistungsverträgen",null,null,null,null,null,null,null,"z.B. Zuständige kantonale Stelle(n) und wichtigste Umsetzungspartner / Partner mit Leistungsverträgen",null,null,null,null,null,null,null,"z.B. Zuständige kantonale Stelle(n) und wichtigste Umsetzungspartner / Partner mit Leistungsverträgen",null,null,null,null,null,null,null,"z.B. Zuständige kantonale Stelle(n) und wichtigste Umsetzungspartner / Partner mit Leistungsverträgen",null,null,null,null,null,null,null,"z.B. Zuständige kantonale Stelle(n) und wichtigste Umsetzungspartner / Partner mit Leistungsverträgen",null,null,null,null,null,null,null,"z.B. Zuständige kantonale Stelle(n) und wichtigste Umsetzungspartner / Partner mit Leistungsverträgen",null,null,null,null,null,null,null,"z.B. Zuständige kantonale Stelle(n) und wichtigste Umsetzungspartner / Partner mit Leistungsverträgen",null,null,null,null,null,null,null,"z.B. Zuständige kantonale Stelle(n) und wichtigste Umsetzungspartner / Partner mit Leistungsverträgen",null,null,null,null,null,null,null,"z.B. Zuständige kantonale Stelle(n) und wichtigste Umsetzungspartner / Partner mit Leistungsverträgen",null,null,null,null,null,null,null,"z.B. Zuständige kantonale Stelle(n) und wichtigste Umsetzungspartner / Partner mit Leistungsverträgen",null,null,null,null,null,null,null,"z.B. Zuständige kantonale Stelle(n) und wichtigste Umsetzungspartner / Partner mit Leistungsverträgen",null,null,null,null,null,null,null,"z.B. Zuständige kantonale Stelle(n) und wichtigste Umsetzungspartner / Partner mit Leistungsverträgen",null,null,null,null,null,null,null,"z.B. Zuständige kantonale Stelle(n) und wichtigste Umsetzungspartner / Partner mit Leistungsverträgen",null,null,null,null,null,null,null,"z.B. Zuständige kantonale Stelle(n) und wichtigste Umsetzungspartner / Partner mit Leistungsverträgen",null,null,null,null,null,null,null,"z.B. Zuständige kantonale Stelle(n) und wichtigste Umsetzungspartner / Partner mit Leistungsverträgen",null,null,null,null,null,null,null,"z.B. Zuständige kantonale Stelle(n) und wichtigste Umsetzungspartner / Partner mit Leistungsverträgen",null,null,null,null,null,null,null,"z.B. Zuständige kantonale Stelle(n) und wichtigste Umsetzungspartner / Partner mit Leistungsverträgen",null,null,null,null,null,null,null,"z.B. Zuständige kantonale Stelle(n) und wichtigste Umsetzungspartner / Partner mit Leistungsverträgen",null,null,null,null,null,null,null,"z.B. Zuständige kantonale Stelle(n) und wichtigste Umsetzungspartner / Partner mit Leistungsverträgen",null,null,null,null,null,null,null,"z.B. Zuständige kantonale Stelle(n) und wichtigste Umsetzungspartner / Partner mit Leistungsverträgen",null,null,null,null,null,null,null,"z.B. Zuständige kantonale Stelle(n) und wichtigste Umsetzungspartner / Partner mit Leistungsverträgen",null,null,null,null,null,null,null,"z.B. Zuständige kantonale Stelle(n) und wichtigste Umsetzungspartner / Partner mit Leistungsverträgen",null,null,null,null,null,null,null,"z.B. Zuständige kantonale Stelle(n) und wichtigste Umsetzungspartner / Partner mit Leistungsverträgen",null,null,null,null,null,null,null,"z.B. Zuständige kantonale Stelle(n) und wichtigste Umsetzungspartner / Partner mit Leistungsverträgen",null,null,null,null,null,null,null,"z.B. Zuständige kantonale Stelle(n) und wichtigste Umsetzungspartner / Partner mit Leistungsverträgen",null,null,null,null,null,null,null,"z.B. Zuständige kantonale Stelle(n) und wichtigste Umsetzungspartner / Partner mit Leistungsverträgen",null,null,null,null,null,null,null,"z.B. Zuständige kantonale Stelle(n) und wichtigste Umsetzungspartner / Partner mit Leistungsverträgen",null,null,null,null,null,null,null,"z.B. Zuständige kantonale Stelle(n) und wichtigste Umsetzungspartner / Partner mit Leistungsverträgen",null,null,null,null,null,null,null,"z.B. Zuständige kantonale Stelle(n) und wichtigste Umsetzungspartner / Partner mit Leistungsverträgen",null,null,null,null,null,null,null,"z.B. Zuständige kantonale Stelle(n) und wichtigste Umsetzungspartner / Partner mit Leistungsverträgen",null,null,null,null,null,null,null,"z.B. Zuständige kantonale Stelle(n) und wichtigste Umsetzungspartner / Partner mit Leistungsverträgen",null,null,null,null,null,null,null,"z.B. Zuständige kantonale Stelle(n) und wichtigste Umsetzungspartner / Partner mit Leistungsverträgen",null,null,null,null,null,null,null,"z.B. Zuständige kantonale Stelle(n) und wichtigste Umsetzungspartner / Partner mit Leistungsverträgen",null,null,null,null,null,null,null,"z.B. Zuständige kantonale Stelle(n) und wichtigste Umsetzungspartner / Partner mit Leistungsverträgen",null,null,null,null,null,null,null,"z.B. Zuständige kantonale Stelle(n) und wichtigste Umsetzungspartner / Partner mit Leistungsverträgen",null,null,null,null,null,null,null,"z.B. Zuständige kantonale Stelle(n) und wichtigste Umsetzungspartner / Partner mit Leistungsverträgen",null,null,null,null,null,null,null,"z.B. Zuständige kantonale Stelle(n) und wichtigste Umsetzungspartner / Partner mit Leistungsverträgen",null,null,null,null,null,null,null,"z.B. Zuständige kantonale Stelle(n) und wichtigste Umsetzungspartner / Partner mit Leistungsverträgen",null,null,null,null,null,null,null,"z.B. Zuständige kantonale Stelle(n) und wichtigste Umsetzungspartner / Partner mit Leistungsverträgen",null,null,null,null,null,null,null,"z.B. Zuständige kantonale Stelle(n) und wichtigste Umsetzungspartner / Partner mit Leistungsverträgen",null,null,null,null,null,null,null,"z.B. Zuständige kantonale Stelle(n) und wichtigste Umsetzungspartner / Partner mit Leistungsverträgen",null,null,null,null,null,null,null,"z.B. Zuständige kantonale Stelle(n) und wichtigste Umsetzungspartner / Partner mit Leistungsverträgen",null,null,null,null,null,null,null,"z.B. Zuständige kantonale Stelle(n) und wichtigste Umsetzungspartner / Partner mit Leistungsverträgen",null,null,null,null,null,null,null,"z.B. Zuständige kantonale Stelle(n) und wichtigste Umsetzungspartner / Partner mit Leistungsverträgen",null,null,null,null,null,null,null,"z.B. Zuständige kantonale Stelle(n) und wichtigste Umsetzungspartner / Partner mit Leistungsverträgen",null,null,null,null,null,null,null,"z.B. Zuständige kantonale Stelle(n) und wichtigste Umsetzungspartner / Partner mit Leistungsverträgen",null,null,null,null,null,null,null,"z.B. Zuständige kantonale Stelle(n) und wichtigste Umsetzungspartner / Partner mit Leistungsverträgen",null,null,null,null,null,null,null,"z.B. Zuständige kantonale Stelle(n) und wichtigste Umsetzungspartner / Partner mit Leistungsverträgen",null,null,null,null,null,null,null,"z.B. Zuständige kantonale Stelle(n) und wichtigste Umsetzungspartner / Partner mit Leistungsverträgen",null,null,null,null,null,null,null,"z.B. Zuständige kantonale Stelle(n) und wichtigste Umsetzungspartner / Partner mit Leistungsverträgen",null,null,null,null,null,null,null,"z.B. Zuständige kantonale Stelle(n) und wichtigste Umsetzungspartner / Partner mit Leistungsverträgen",null,null,null,null,null,null,null,"z.B. Zuständige kantonale Stelle(n) und wichtigste Umsetzungspartner / Partner mit Leistungsverträgen",null,null,null,null,null,null,null,"z.B. Zuständige kantonale Stelle(n) und wichtigste Umsetzungspartner / Partner mit Leistungsverträgen",null,null,null,null,null,null,null,"z.B. Zuständige kantonale Stelle(n) und wichtigste Umsetzungspartner / Partner mit Leistungsverträgen",null,null,null,null,null,null,null,"z.B. Zuständige kantonale Stelle(n) und wichtigste Umsetzungspartner / Partner mit Leistungsverträgen",null,null,null,null,null,null,null,"z.B. Zuständige kantonale Stelle(n) und wichtigste Umsetzungspartner / Partner mit Leistungsverträgen",null,null,null,null,null,null,null,"z.B. Zuständige kantonale Stelle(n) und wichtigste Umsetzungspartner / Partner mit Leistungsverträgen",null,null,null,null,null,null,null,"z.B. Zuständige kantonale Stelle(n) und wichtigste Umsetzungspartner / Partner mit Leistungsverträgen",null,null,null,null,null,null,null,"z.B. Zuständige kantonale Stelle(n) und wichtigste Umsetzungspartner / Partner mit Leistungsverträgen",null,null,null,null,null,null,null,"z.B. Zuständige kantonale Stelle(n) und wichtigste Umsetzungspartner / Partner mit Leistungsverträgen",null,null,null,null,null,null,null,"z.B. Zuständige kantonale Stelle(n) und wichtigste Umsetzungspartner / Partner mit Leistungsverträgen",null,null,null,null,null,null,null,"z.B. Zuständige kantonale Stelle(n) und wichtigste Umsetzungspartner / Partner mit Leistungsverträgen",null,null,null,null,null,null,null,"z.B. Zuständige kantonale Stelle(n) und wichtigste Umsetzungspartner / Partner mit Leistungsverträgen",null,null,null,null,null,null,null,"z.B. Zuständige kantonale Stelle(n) und wichtigste Umsetzungspartner / Partner mit Leistungsverträgen",null,null,null,null,null,null,null,"z.B. Zuständige kantonale Stelle(n) und wichtigste Umsetzungspartner / Partner mit Leistungsverträgen",null,null,null,null,null,null,null,"z.B. Zuständige kantonale Stelle(n) und wichtigste Umsetzungspartner / Partner mit Leistungsverträgen",null,null,null,null,null,null,null,"z.B. Zuständige kantonale Stelle(n) und wichtigste Umsetzungspartner / Partner mit Leistungsverträgen",null,null,null,null,null,null,null,"z.B. Zuständige kantonale Stelle(n) und wichtigste Umsetzungspartner / Partner mit Leistungsverträgen",null,null,null,null,null,null,null,"z.B. Zuständige kantonale Stelle(n) und wichtigste Umsetzungspartner / Partner mit Leistungsverträgen",null,null,null,null,null,null,null,"z.B. Zuständige kantonale Stelle(n) und wichtigste Umsetzungspartner / Partner mit Leistungsverträgen",null,null,null,null,null,null,null,"z.B. Zuständige kantonale Stelle(n) und wichtigste Umsetzungspartner / Partner mit Leistungsverträgen",null,null,null,null,null,null,null,"z.B. Zuständige kantonale Stelle(n) und wichtigste Umsetzungspartner / Partner mit Leistungsverträgen",null,null,null,null,null,null,null,"z.B. Zuständige kantonale Stelle(n) und wichtigste Umsetzungspartner / Partner mit Leistungsverträgen",null,null,null,null,null,null,null,"z.B. Zuständige kantonale Stelle(n) und wichtigste Umsetzungspartner / Partner mit Leistungsverträgen",null,null,null,null,null,null,null,"z.B. Zuständige kantonale Stelle(n) und wichtigste Umsetzungspartner / Partner mit Leistungsverträgen",null,null,null,null,null,null,null,"z.B. Zuständige kantonale Stelle(n) und wichtigste Umsetzungspartner / Partner mit Leistungsverträgen",null,null,null,null,null,null,null,"z.B. Zuständige kantonale Stelle(n) und wichtigste Umsetzungspartner / Partner mit Leistungsverträgen",null,null,null,null,null,null,null,"z.B. Zuständige kantonale Stelle(n) und wichtigste Umsetzungspartner / Partner mit Leistungsverträgen",null,null,null,null,null,null,null,"z.B. Zuständige kantonale Stelle(n) und wichtigste Umsetzungspartner / Partner mit Leistungsverträgen",null,null,null,null,null,null,null,"z.B. Zuständige kantonale Stelle(n) und wichtigste Umsetzungspartner / Partner mit Leistungsverträgen",null,null,null,null,null,null,null,"z.B. Zuständige kantonale Stelle(n) und wichtigste Umsetzungspartner / Partner mit Leistungsverträgen",null,null,null,null,null,null,null,"z.B. Zuständige kantonale Stelle(n) und wichtigste Umsetzungspartner / Partner mit Leistungsverträgen",null,null,null,null,null,null,null,"z.B. Zuständige kantonale Stelle(n) und wichtigste Umsetzungspartner / Partner mit Leistungsverträgen",null,null,null,null,null,null,null,"z.B. Zuständige kantonale Stelle(n) und wichtigste Umsetzungspartner / Partner mit Leistungsverträgen",null,null,null,null,null,null,null,"z.B. Zuständige kantonale Stelle(n) und wichtigste Umsetzungspartner / Partner mit Leistungsverträgen",null,null,null,null,null,null,null,"z.B. Zuständige kantonale Stelle(n) und wichtigste Umsetzungspartner / Partner mit Leistungsverträgen",null,null,null,null,null,null,null,"z.B. Zuständige kantonale Stelle(n) und wichtigste Umsetzungspartner / Partner mit Leistungsverträgen",null,null,null,null,null,null,null,"z.B. Zuständige kantonale Stelle(n) und wichtigste Umsetzungspartner / Partner mit Leistungsverträgen",null,null,null,null,null,null,null,"z.B. Zuständige kantonale Stelle(n) und wichtigste Umsetzungspartner / Partner mit Leistungsverträgen",null,null,null,null,null,null,null,"z.B. Zuständige kantonale Stelle(n) und wichtigste Umsetzungspartner / Partner mit Leistungsverträgen",null,null,null,null,null,null,null,"z.B. Zuständige kantonale Stelle(n) und wichtigste Umsetzungspartner / Partner mit Leistungsverträgen",null,null,null,null,null,null,null,"z.B. Zuständige kantonale Stelle(n) und wichtigste Umsetzungspartner / Partner mit Leistungsverträgen",null,null,null,null,null,null,null,"z.B. Zuständige kantonale Stelle(n) und wichtigste Umsetzungspartner / Partner mit Leistungsverträgen",null,null,null,null,null,null,null,"z.B. Zuständige kantonale Stelle(n) und wichtigste Umsetzungspartner / Partner mit Leistungsverträgen"]
[null,null,null,"Name",null,"Bemerkungen",null,null,"Name",null,"Stelle",null,"Bemerkungen ",null,null,null,"Name",null,"Stelle",null,"Bemerkungen ",null,null,null,"Name",null,"Stelle",null,"Bemerkungen ",null,null,null,"Name",null,"Stelle",null,"Bemerkungen ",null,null,null,"Name",null,"Stelle",null,"Bemerkungen ",null,null,null,"Name",null,"Stelle",null,"Bemerkungen ",null,null,null,"Name",null,"Stelle",null,"Bemerkungen ",null,null,null,"Name",null,"Stelle",null,"Bemerkungen ",null,null,null,"Name",null,"Stelle",null,"Bemerkungen ",null,null,null,"Name",null,"Stelle",null,"Bemerkungen ",null,null,null,"Name",null,"Stelle",null,"Bemerkungen ",null,null,null,"Name",null,"Stelle",null,"Bemerkungen ",null,null,null,"Name",null,"Stelle",null,"Bemerkungen ",null,null,null,"Name",null,"Stelle",null,"Bemerkungen ",null,null,null,"Name",null,"Stelle",null,"Bemerkungen ",null,null,null,"Name",null,"Stelle",null,"Bemerkungen ",null,null,null,"Name",null,"Stelle",null,"Bemerkungen ",null,null,null,"Name",null,"Stelle",null,"Bemerkungen ",null,null,null,"Name",null,"Stelle",null,"Bemerkungen ",null,null,null,"Name",null,"Stelle",null,"Bemerkungen ",null,null,null,"Name",null,"Stelle",null,"Bemerkungen ",null,null,null,"Name",null,"Stelle",null,"Bemerkungen ",null,null,null,"Name",null,"Stelle",null,"Bemerkungen ",null,null,null,"Name",null,"Stelle",null,"Bemerkungen ",null,null,null,"Name",null,"Stelle",null,"Bemerkungen ",null,null,null,"Name",null,"Stelle",null,"Bemerkungen ",null,null,null,"Name",null,"Stelle",null,"Bemerkungen ",null,null,null,"Name",null,"Stelle",null,"Bemerkungen ",null,null,null,"Name",null,"Stelle",null,"Bemerkungen ",null,null,null,"Name",null,"Stelle",null,"Bemerkungen ",null,null,null,"Name",null,"Stelle",null,"Bemerkungen ",null,null,null,"Name",null,"Stelle",null,"Bemerkungen ",null,null,null,"Name",null,"Stelle",null,"Bemerkungen ",null,null,null,"Name",null,"Stelle",null,"Bemerkungen ",null,null,null,"Name",null,"Stelle",null,"Bemerkungen ",null,null,null,"Name",null,"Stelle",null,"Bemerkungen ",null,null,null,"Name",null,"Stelle",null,"Bemerkungen ",null,null,null,"Name",null,"Stelle",null,"Bemerkungen ",null,null,null,"Name",null,"Stelle",null,"Bemerkungen ",null,null,null,"Name",null,"Stelle",null,"Bemerkungen ",null,null,null,"Name",null,"Stelle",null,"Bemerkungen ",null,null,null,"Name",null,"Stelle",null,"Bemerkungen ",null,null,null,"Name",null,"Stelle",null,"Bemerkungen ",null,null,null,"Name",null,"Stelle",null,"Bemerkungen ",null,null,null,"Name",null,"Stelle",null,"Bemerkungen ",null,null,null,"Name",null,"Stelle",null,"Bemerkungen ",null,null,null,"Name",null,"Stelle",null,"Bemerkungen ",null,null,null,"Name",null,"Stelle",null,"Bemerkungen ",null,null,null,"Name",null,"Stelle",null,"Bemerkungen ",null,null,null,"Name",null,"Stelle",null,"Bemerkungen ",null,null,null,"Name",null,"Stelle",null,"Bemerkungen ",null,null,null,"Name",null,"Stelle",null,"Bemerkungen ",null,null,null,"Name",null,"Stelle",null,"Bemerkungen ",null,null,null,"Name",null,"Stelle",null,"Bemerkungen ",null,null,null,"Name",null,"Stelle",null,"Bemerkungen ",null,null,null,"Name",null,"Stelle",null,"Bemerkungen ",null,null,null,"Name",null,"Stelle",null,"Bemerkungen ",null,null,null,"Name",null,"Stelle",null,"Bemerkungen ",null,null,null,"Name",null,"Stelle",null,"Bemerkungen ",null,null,null,"Name",null,"Stelle",null,"Bemerkungen ",null,null,null,"Name",null,"Stelle",null,"Bemerkungen ",null,null,null,"Name",null,"Stelle",null,"Bemerkungen ",null,null,null,"Name",null,"Stelle",null,"Bemerkungen ",null,null,null,"Name",null,"Stelle",null,"Bemerkungen ",null,null,null,"Name",null,"Stelle",null,"Bemerkungen ",null,null,null,"Name",null,"Stelle",null,"Bemerkungen ",null,null,null,"Name",null,"Stelle",null,"Bemerkungen ",null,null,null,"Name",null,"Stelle",null,"Bemerkungen ",null,null,null,"Name",null,"Stelle",null,"Bemerkungen ",null,null,null,"Name",null,"Stelle",null,"Bemerkungen ",null,null,null,"Name",null,"Stelle",null,"Bemerkungen ",null,null,null,"Name",null,"Stelle",null,"Bemerkungen ",null,null,null,"Name",null,"Stelle",null,"Bemerkungen ",null,null,null,"Name",null,"Stelle",null,"Bemerkungen ",null,null,null,"Name",null,"Stelle",null,"Bemerkungen ",null,null,null,"Name",null,"Stelle",null,"Bemerkungen ",null,null,null,"Name",null,"Stelle",null,"Bemerkungen ",null,null,null,"Name",null,"Stelle",null,"Bemerkungen ",null,null,null,"Name",null,"Stelle",null,"Bemerkungen ",null,null,null,"Name",null,"Stelle",null,"Bemerkungen ",null,null,null,"Name",null,"Stelle",null,"Bemerkungen ",null,null,null,"Name",null,"Stelle",null,"Bemerkungen ",null,null,null,"Name",null,"Stelle",null,"Bemerkungen ",null,null,null,"Name",null,"Stelle",null,"Bemerkungen ",null,null,null,"Name",null,"Stelle",null,"Bemerkungen ",null,null,null,"Name",null,"Stelle",null,"Bemerkungen ",null,null,null,"Name",null,"Stelle",null,"Bemerkungen ",null,null,null,"Name",null,"Stelle",null,"Bemerkungen ",null,null,null,"Name",null,"Stelle",null,"Bemerkungen ",null,null,null,"Name",null,"Stelle",null,"Bemerkungen ",null,null,null,"Name",null,"Stelle",null,"Bemerkungen ",null,null,null,"Name",null,"Stelle",null,"Bemerkungen ",null,null,null,"Name",null,"Stelle",null,"Bemerkungen ",null,null,null,"Name",null,"Stelle",null,"Bemerkungen ",null,null,null,"Name",null,"Stelle",null,"Bemerkungen ",null,null,null,"Name",null,"Stelle",null,"Bemerkungen ",null,null,null,"Name",null,"Stelle",null,"Bemerkungen ",null,null,null,"Name",null,"Stelle",null,"Bemerkungen ",null,null,null,"Name",null,"Stelle",null,"Bemerkungen ",null,null,null,"Name",null,"Stelle",null,"Bemerkungen ",null,null,null,"Name",null,"Stelle",null,"Bemerkungen ",null,null,null,"Name",null,"Stelle",null,"Bemerkungen ",null,null,null,"Name",null,"Stelle",null,"Bemerkungen ",null,null,null,"Name",null,"Stelle",null,"Bemerkungen ",null,null,null,"Name",null,"Stelle",null,"Bemerkungen ",null,null,null,"Name",null,"Stelle",null,"Bemerkungen ",null,null,null,"Name",null,"Stelle",null,"Bemerkungen ",null,null,null,"Name",null,"Stelle",null,"Bemerkungen ",null,null,null,"Name",null,"Stelle",null,"Bemerkungen ",null,null,null,"Name",null,"Stelle",null,"Bemerkungen ",null,null,null,"Name",null,"Stelle",null,"Bemerkungen ",null,null,null,"Name",null,"Stelle",null,"Bemerkungen ",null,null,null,"Name",null,"Stelle",null,"Bemerkungen ",null,null,null,"Name",null,"Stelle",null,"Bemerkungen ",null,null,null,"Name",null,"Stelle",null,"Bemerkungen ",null,null,null,"Name",null,"Stelle",null,"Bemerkungen ",null,null,null,"Name",null,"Stelle",null,"Bemerkungen ",null,null,null,"Name",null,"Stelle",null,"Bemerkungen ",null,null,null,"Name",null,"Stelle",null,"Bemerkungen ",null,null,null,"Name",null,"Stelle",null,"Bemerkungen ",null,null,null,"Name",null,"Stelle",null,"Bemerkungen ",null,null,null,"Name",null,"Stelle",null,"Bemerkungen ",null,null,null,"Name",null,"Stelle",null,"Bemerkungen ",null,null,null,"Name",null,"Stelle",null,"Bemerkungen ",null,null,null,"Name",null,"Stelle",null,"Bemerkungen ",null,null,null,"Name",null,"Stelle",null,"Bemerkungen ",null,null,null,"Name",null,"Stelle",null,"Bemerkungen ",null,null,null,"Name",null,"Stelle",null,"Bemerkungen ",null,null,null,"Name",null,"Stelle",null,"Bemerkungen ",null,null,null,"Name",null,"Stelle",null,"Bemerkungen ",null,null,null,"Name",null,"Stelle",null,"Bemerkungen ",null,null,null,"Name",null,"Stelle",null,"Bemerkungen ",null,null,null,"Name",null,"Stelle",null,"Bemerkungen ",null,null,null,"Name",null,"Stelle",null,"Bemerkungen ",null,null,null,"Name",null,"Stelle",null,"Bemerkungen ",null,null,null,"Name",null,"Stelle",null,"Bemerkungen ",null,null,null,"Name",null,"Stelle",null,"Bemerkungen ",null,null,null,"Name",null,"Stelle",null,"Bemerkungen ",null,null,null,"Name",null,"Stelle",null,"Bemerkungen ",null,null,null,"Name",null,"Stelle",null,"Bemerkungen ",null,null,null,"Name",null,"Stelle",null,"Bemerkungen ",null,null,null,"Name",null,"Stelle",null,"Bemerkungen ",null,null,null,"Name",null,"Stelle",null,"Bemerkungen ",null,null,null,"Name",null,"Stelle",null,"Bemerkungen ",null,null,null,"Name",null,"Stelle",null,"Bemerkungen ",null,null,null,"Name",null,"Stelle",null,"Bemerkungen ",null,null,null,"Name",null,"Stelle",null,"Bemerkungen ",null,null,null,"Name",null,"Stelle",null,"Bemerkungen ",null,null,null,"Name",null,"Stelle",null,"Bemerkungen ",null,null,null,"Name",null,"Stelle",null,"Bemerkungen ",null,null,null,"Name",null,"Stelle",null,"Bemerkungen ",null,null,null,"Name",null,"Stelle",null,"Bemerkungen ",null,null,null,"Name",null,"Stelle",null,"Bemerkungen ",null,null,null,"Name",null,"Stelle",null,"Bemerkungen ",null,null,null,"Name",null,"Stelle",null,"Bemerkungen ",null,null,null,"Name",null,"Stelle",null,"Bemerkungen ",null,null,null,"Name",null,"Stelle",null,"Bemerkungen ",null,null,null,"Name",null,"Stelle",null,"Bemerkungen ",null,null,null,"Name",null,"Stelle",null,"Bemerkungen ",null,null,null,"Name",null,"Stelle",null,"Bemerkungen ",null,null,null,"Name",null,"Stelle",null,"Bemerkungen ",null,null,null,"Name",null,"Stelle",null,"Bemerkungen ",null,null,null,"Name",null,"Stelle",null,"Bemerkungen ",null,null,null,"Name",null,"Stelle",null,"Bemerkungen ",null,null,null,"Name",null,"Stelle",null,"Bemerkungen ",null,null,null,"Name",null,"Stelle",null,"Bemerkungen ",null,null,null,"Name",null,"Stelle",null,"Bemerkungen ",null,null,null,"Name",null,"Stelle",null,"Bemerkungen ",null,null,null,"Name",null,"Stelle",null,"Bemerkungen ",null,null,null,"Name",null,"Stelle",null,"Bemerkungen ",null,null,null,"Name",null,"Stelle",null,"Bemerkungen ",null,null,null,"Name",null,"Stelle",null,"Bemerkungen ",null,null,null,"Name",null,"Stelle",null,"Bemerkungen ",null,null,null,"Name",null,"Stelle",null,"Bemerkungen ",null,null,null,"Name",null,"Stelle",null,"Bemerkungen ",null,null,null,"Name",null,"Stelle",null,"Bemerkungen ",null,null,null,"Name",null,"Stelle",null,"Bemerkungen ",null,null,null,"Name",null,"Stelle",null,"Bemerkungen ",null,null,null,"Name",null,"Stelle",null,"Bemerkungen ",null,null,null,"Name",null,"Stelle",null,"Bemerkungen ",null,null,null,"Name",null,"Stelle",null,"Bemerkungen ",null,null,null,"Name",null,"Stelle",null,"Bemerkungen ",null,null,null,"Name",null,"Stelle",null,"Bemerkungen ",null,null,null,"Name",null,"Stelle",null,"Bemerkungen ",null,null,null,"Name",null,"Stelle",null,"Bemerkungen ",null,null,null,"Name",null,"Stelle",null,"Bemerkungen ",null,null,null,"Name",null,"Stelle",null,"Bemerkungen ",null,null,null,"Name",null,"Stelle",null,"Bemerkungen ",null,null,null,"Name",null,"Stelle",null,"Bemerkungen ",null,null,null,"Name",null,"Stelle",null,"Bemerkungen ",null,null,null,"Name",null,"Stelle",null,"Bemerkungen ",null,null,null,"Name",null,"Stelle",null,"Bemerkungen ",null,null,null,"Name",null,"Stelle",null,"Bemerkungen ",null,null,null,"Name",null,"Stelle",null,"Bemerkungen ",null,null,null,"Name",null,"Stelle",null,"Bemerkungen ",null,null,null,"Name",null,"Stelle",null,"Bemerkungen ",null,null,null,"Name",null,"Stelle",null,"Bemerkungen ",null,null,null,"Name",null,"Stelle",null,"Bemerkungen ",null,null,null,"Name",null,"Stelle",null,"Bemerkungen ",null,null,null,"Name",null,"Stelle",null,"Bemerkungen ",null,null,null,"Name",null,"Stelle",null,"Bemerkungen ",null,null,null,"Name",null,"Stelle",null,"Bemerkungen ",null,null,null,"Name",null,"Stelle",null,"Bemerkungen ",null,null,null,"Name",null,"Stelle",null,"Bemerkungen ",null,null,null,"Name",null,"Stelle",null,"Bemerkungen ",null,null,null,"Name",null,"Stelle",null,"Bemerkungen ",null,null,null,"Name",null,"Stelle",null,"Bemerkungen ",null,null,null,"Name",null,"Stelle",null,"Bemerkungen ",null,null,null,"Name",null,"Stelle",null,"Bemerkungen ",null,null,null,"Name",null,"Stelle",null,"Bemerkungen ",null,null,null,"Name",null,"Stelle",null,"Bemerkungen ",null,null,null,"Name",null,"Stelle",null,"Bemerkungen ",null,null,null,"Name",null,"Stelle",null,"Bemerkungen ",null,null,null,"Name",null,"Stelle",null,"Bemerkungen ",null,null,null,"Name",null,"Stelle",null,"Bemerkungen ",null,null,null,"Name",null,"Stelle",null,"Bemerkungen ",null,null,null,"Name",null,"Stelle",null,"Bemerkungen ",null,null,null,"Name",null,"Stelle",null,"Bemerkungen ",null,null,null,"Name",null,"Stelle",null,"Bemerkungen ",null,null,null,"Name",null,"Stelle",null,"Bemerkungen ",null,null,null,"Name",null,"Stelle",null,"Bemerkungen ",null,null,null,"Name",null,"Stelle",null,"Bemerkungen ",null,null,null,"Name",null,"Stelle",null,"Bemerkungen ",null,null,null,"Name",null,"Stelle",null,"Bemerkungen ",null,null,null,"Name",null,"Stelle",null,"Bemerkungen ",null,null,null,"Name",null,"Stelle",null,"Bemerkungen ",null,null,null,"Name",null,"Stelle",null,"Bemerkungen ",null,null,null,"Name",null,"Stelle",null,"Bemerkungen ",null,null,null,"Name",null,"Stelle",null,"Bemerkungen ",null,null,null,"Name",null,"Stelle",null,"Bemerkungen ",null,null,null,"Name",null,"Stelle",null,"Bemerkungen ",null,null,null,"Name",null,"Stelle",null,"Bemerkungen ",null,null,null,"Name",null,"Stelle",null,"Bemerkungen ",null,null,null,"Name",null,"Stelle",null,"Bemerkungen ",null,null,null,"Name",null,"Stelle",null,"Bemerkungen ",null,null,null,"Name",null,"Stelle",null,"Bemerkungen ",null,null,null,"Name",null,"Stelle",null,"Bemerkungen ",null,null,null,"Name",null,"Stelle",null,"Bemerkungen ",null,null,null,"Name",null,"Stelle",null,"Bemerkungen ",null,null,null,"Name",null,"Stelle",null,"Bemerkungen ",null,null,null,"Name",null,"Stelle",null,"Bemerkungen ",null,null,null,"Name",null,"Stelle",null,"Bemerkungen ",null,null,null,"Name",null,"Stelle",null,"Bemerkungen ",null,null,null,"Name",null,"Stelle",null,"Bemerkungen ",null,null,null,"Name",null,"Stelle",null,"Bemerkungen ",null,null,null,"Name",null,"Stelle",null,"Bemerkungen ",null,null,null,"Name",null,"Stelle",null,"Bemerkungen ",null,null,null,"Name",null,"Stelle",null,"Bemerkungen ",null,null,null,"Name",null,"Stelle",null,"Bemerkungen ",null,null,null,"Name",null,"Stelle",null,"Bemerkungen ",null,null,null,"Name",null,"Stelle",null,"Bemerkungen ",null,null,null,"Name",null,"Stelle",null,"Bemerkungen ",null,null,null,"Name",null,"Stelle",null,"Bemerkungen ",null,null,null,"Name",null,"Stelle",null,"Bemerkungen ",null,null,null,"Name",null,"Stelle",null,"Bemerkungen ",null,null,null,"Name",null,"Stelle",null,"Bemerkungen ",null,null,null,"Name",null,"Stelle",null,"Bemerkungen ",null,null,null,"Name",null,"Stelle",null,"Bemerkungen ",null,null,null,"Name",null,"Stelle",null,"Bemerkungen ",null,null,null,"Name",null,"Stelle",null,"Bemerkungen ",null,null,null,"Name",null,"Stelle",null,"Bemerkungen ",null,null,null,"Name",null,"Stelle",null,"Bemerkungen ",null,null,null,"Name",null,"Stelle",null,"Bemerkungen ",null,null,null,"Name",null,"Stelle",null,"Bemerkungen ",null,null,null,"Name",null,"Stelle",null,"Bemerkungen ",null,null,null,"Name",null,"Stelle",null,"Bemerkungen ",null,null,null,"Name",null,"Stelle",null,"Bemerkungen ",null,null,null,"Name",null,"Stelle",null,"Bemerkungen ",null,null,null,"Name",null,"Stelle",null,"Bemerkungen ",null,null,null,"Name",null,"Stelle",null,"Bemerkungen ",null,null,null,"Name",null,"Stelle",null,"Bemerkungen ",null,null,null,"Name",null,"Stelle",null,"Bemerkungen ",null,null,null,"Name",null,"Stelle",null,"Bemerkungen ",null,null,null,"Name",null,"Stelle",null,"Bemerkungen ",null,null,null,"Name",null,"Stelle",null,"Bemerkungen ",null,null,null,"Name",null,"Stelle",null,"Bemerkungen ",null,null,null,"Name",null,"Stelle",null,"Bemerkungen ",null,null,null,"Name",null,"Stelle",null,"Bemerkungen ",null,null,null,"Name",null,"Stelle",null,"Bemerkungen ",null,null,null,"Name",null,"Stelle",null,"Bemerkungen ",null,null,null,"Name",null,"Stelle",null,"Bemerkungen ",null,null,null,"Name",null,"Stelle",null,"Bemerkungen ",null,null,null,"Name",null,"Stelle",null,"Bemerkungen ",null,null,null,"Name",null,"Stelle",null,"Bemerkungen ",null,null,null,"Name",null,"Stelle",null,"Bemerkungen ",null,null,null,"Name",null,"Stelle",null,"Bemerkungen ",null,null,null,"Name",null,"Stelle",null,"Bemerkungen ",null,null,null,"Name",null,"Stelle",null,"Bemerkungen ",null,null,null,"Name",null,"Stelle",null,"Bemerkungen ",null,null,null,"Name",null,"Stelle",null,"Bemerkungen ",null,null,null,"Name",null,"Stelle",null,"Bemerkungen ",null,null,null,"Name",null,"Stelle",null,"Bemerkungen ",null,null,null,"Name",null,"Stelle",null,"Bemerkungen ",null,null,null,"Name",null,"Stelle",null,"Bemerkungen ",null,null,null,"Name",null,"Stelle",null,"Bemerkungen ",null,null,null,"Name",null,"Stelle",null,"Bemerkungen ",null,null,null,"Name",null,"Stelle",null,"Bemerkungen ",null,null,null,"Name",null,"Stelle",null,"Bemerkungen ",null,null,null,"Name",null,"Stelle",null,"Bemerkungen ",null,null,null,"Name",null,"Stelle",null,"Bemerkungen ",null,null,null,"Name",null,"Stelle",null,"Bemerkungen ",null,null,null,"Name",null,"Stelle",null,"Bemerkungen ",null,null,null,"Name",null,"Stelle",null,"Bemerkungen ",null,null,null,"Name",null,"Stelle",null,"Bemerkungen ",null,null,null,"Name",null,"Stelle",null,"Bemerkungen ",null,null,null,"Name",null,"Stelle",null,"Bemerkungen ",null,null,null,"Name",null,"Stelle",null,"Bemerkungen ",null,null,null,"Name",null,"Stelle",null,"Bemerkungen ",null,null,null,"Name",null,"Stelle",null,"Bemerkungen ",null,null,null,"Name",null,"Stelle",null,"Bemerkungen ",null,null,null,"Name",null,"Stelle",null,"Bemerkungen ",null,null,null,"Name",null,"Stelle",null,"Bemerkungen ",null,null,null,"Name",null,"Stelle",null,"Bemerkungen ",null,null,null,"Name",null,"Stelle",null,"Bemerkungen ",null,null,null,"Name",null,"Stelle",null,"Bemerkungen ",null,null,null,"Name",null,"Stelle",null,"Bemerkungen ",null,null,null,"Name",null,"Stelle",null,"Bemerkungen ",null,null,null,"Name",null,"Stelle",null,"Bemerkungen ",null,null,null,"Name",null,"Stelle",null,"Bemerkungen ",null,null,null,"Name",null,"Stelle",null,"Bemerkungen ",null,null,null,"Name",null,"Stelle",null,"Bemerkungen ",null,null,null,"Name",null,"Stelle",null,"Bemerkungen ",null,null,null,"Name",null,"Stelle",null,"Bemerkungen ",null,null,null,"Name",null,"Stelle",null,"Bemerkungen ",null,null,null,"Name",null,"Stelle",null,"Bemerkungen ",null,null,null,"Name",null,"Stelle",null,"Bemerkungen ",null,null,null,"Name",null,"Stelle",null,"Bemerkungen ",null,null,null,"Name",null,"Stelle",null,"Bemerkungen ",null,null,null,"Name",null,"Stelle",null,"Bemerkungen ",null,null,null,"Name",null,"Stelle",null,"Bemerkungen ",null,null,null,"Name",null,"Stelle",null,"Bemerkungen ",null,null,null,"Name",null,"Stelle",null,"Bemerkungen ",null,null,null,"Name",null,"Stelle",null,"Bemerkungen ",null,null,null,"Name",null,"Stelle",null,"Bemerkungen ",null,null,null,"Name",null,"Stelle",null,"Bemerkungen ",null,null,null,"Name",null,"Stelle",null,"Bemerkungen ",null,null,null,"Name",null,"Stelle",null,"Bemerkungen ",null,null,null,"Name",null,"Stelle",null,"Bemerkungen ",null,null,null,"Name",null,"Stelle",null,"Bemerkungen ",null,null,null,"Name",null,"Stelle",null,"Bemerkungen ",null,null,null,"Name",null,"Stelle",null,"Bemerkungen ",null,null,null,"Name",null,"Stelle",null,"Bemerkungen ",null,null,null,"Name",null,"Stelle",null,"Bemerkungen ",null,null,null,"Name",null,"Stelle",null,"Bemerkungen ",null,null,null,"Name",null,"Stelle",null,"Bemerkungen ",null,null,null,"Name",null,"Stelle",null,"Bemerkungen ",null,null,null,"Name",null,"Stelle",null,"Bemerkungen ",null,null,null,"Name",null,"Stelle",null,"Bemerkungen ",null,null,null,"Name",null,"Stelle",null,"Bemerkungen ",null,null,null,"Name",null,"Stelle",null,"Bemerkungen ",null,null,null,"Name",null,"Stelle",null,"Bemerkungen ",null,null,null,"Name",null,"Stelle",null,"Bemerkungen ",null,null,null,"Name",null,"Stelle",null,"Bemerkungen ",null,null,null,"Name",null,"Stelle",null,"Bemerkungen ",null,null,null,"Name",null,"Stelle",null,"Bemerkungen ",null,null,null,"Name",null,"Stelle",null,"Bemerkungen ",null,null,null,"Name",null,"Stelle",null,"Bemerkungen ",null,null,null,"Name",null,"Stelle",null,"Bemerkungen ",null,null,null,"Name",null,"Stelle",null,"Bemerkungen ",null,null,null,"Name",null,"Stelle",null,"Bemerkungen ",null,null,null,"Name",null,"Stelle",null,"Bemerkungen ",null,null,null,"Name",null,"Stelle",null,"Bemerkungen ",null,null,null,"Name",null,"Stelle",null,"Bemerkungen ",null,null,null,"Name",null,"Stelle",null,"Bemerkungen ",null,null,null,"Name",null,"Stelle",null,"Bemerkungen ",null,null,null,"Name",null,"Stelle",null,"Bemerkungen ",null,null,null,"Name",null,"Stelle",null,"Bemerkungen ",null,null,null,"Name",null,"Stelle",null,"Bemerkungen ",null,null,null,"Name",null,"Stelle",null,"Bemerkungen ",null,null,null,"Name",null,"Stelle",null,"Bemerkungen ",null,null,null,"Name",null,"Stelle",null,"Bemerkungen ",null,null,null,"Name",null,"Stelle",null,"Bemerkungen ",null,null,null,"Name",null,"Stelle",null,"Bemerkungen ",null,null,null,"Name",null,"Stelle",null,"Bemerkungen ",null,null,null,"Name",null,"Stelle",null,"Bemerkungen ",null,null,null,"Name",null,"Stelle",null,"Bemerkungen ",null,null,null,"Name",null,"Stelle",null,"Bemerkungen ",null,null,null,"Name",null,"Stelle",null,"Bemerkungen ",null,null,null,"Name",null,"Stelle",null,"Bemerkungen ",null,null,null,"Name",null,"Stelle",null,"Bemerkungen ",null,null,null,"Name",null,"Stelle",null,"Bemerkungen ",null,null,null,"Name",null,"Stelle",null,"Bemerkungen ",null,null,null,"Name",null,"Stelle",null,"Bemerkungen ",null,null,null,"Name",null,"Stelle",null,"Bemerkungen ",null,null,null,"Name",null,"Stelle",null,"Bemerkungen ",null,null,null,"Name",null,"Stelle",null,"Bemerkungen ",null,null,null,"Name",null,"Stelle",null,"Bemerkungen ",null,null,null,"Name",null,"Stelle",null,"Bemerkungen ",null,null,null,"Name",null,"Stelle",null,"Bemerkungen ",null,null,null,"Name",null,"Stelle",null,"Bemerkungen ",null,null,null,"Name",null,"Stelle",null,"Bemerkungen ",null,null,null,"Name",null,"Stelle",null,"Bemerkungen ",null,null,null,"Name",null,"Stelle",null,"Bemerkungen ",null,null,null,"Name",null,"Stelle",null,"Bemerkungen ",null,null,null,"Name",null,"Stelle",null,"Bemerkungen ",null,null,null,"Name",null,"Stelle",null,"Bemerkungen ",null,null,null,"Name",null,"Stelle",null,"Bemerkungen ",null,null,null,"Name",null,"Stelle",null,"Bemerkungen ",null,null,null,"Name",null,"Stelle",null,"Bemerkungen ",null,null,null,"Name",null,"Stelle",null,"Bemerkungen ",null,null,null,"Name",null,"Stelle",null,"Bemerkungen ",null,null,null,"Name",null,"Stelle",null,"Bemerkungen ",null,null,null,"Name",null,"Stelle",null,"Bemerkungen ",null,null,null,"Name",null,"Stelle",null,"Bemerkungen ",null,null,null,"Name",null,"Stelle",null,"Bemerkungen ",null,null,null,"Name",null,"Stelle",null,"Bemerkungen ",null,null,null,"Name",null,"Stelle",null,"Bemerkungen ",null,null,null,"Name",null,"Stelle",null,"Bemerkungen ",null,null,null,"Name",null,"Stelle",null,"Bemerkungen ",null,null,null,"Name",null,"Stelle",null,"Bemerkungen ",null,null,null,"Name",null,"Stelle",null,"Bemerkungen ",null,null,null,"Name",null,"Stelle",null,"Bemerkungen ",null,null,null,"Name",null,"Stelle",null,"Bemerkungen ",null,null,null,"Name",null,"Stelle",null,"Bemerkungen ",null,null,null,"Name",null,"Stelle",null,"Bemerkungen ",null,null,null,"Name",null,"Stelle",null,"Bemerkungen ",null,null,null,"Name",null,"Stelle",null,"Bemerkungen ",null,null,null,"Name",null,"Stelle",null,"Bemerkungen ",null,null,null,"Name",null,"Stelle",null,"Bemerkungen ",null,null,null,"Name",null,"Stelle",null,"Bemerkungen ",null,null,null,"Name",null,"Stelle",null,"Bemerkungen ",null,null,null,"Name",null,"Stelle",null,"Bemerkungen ",null,null,null,"Name",null,"Stelle",null,"Bemerkungen ",null,null,null,"Name",null,"Stelle",null,"Bemerkungen ",null,null,null,"Name",null,"Stelle",null,"Bemerkungen ",null,null,null,"Name",null,"Stelle",null,"Bemerkungen ",null,null,null,"Name",null,"Stelle",null,"Bemerkungen ",null,null,null,"Name",null,"Stelle",null,"Bemerkungen ",null,null,null,"Name",null,"Stelle",null,"Bemerkungen ",null,null,null,"Name",null,"Stelle",null,"Bemerkungen ",null,null,null,"Name",null,"Stelle",null,"Bemerkungen ",null,null,null,"Name",null,"Stelle",null,"Bemerkungen ",null,null,null,"Name",null,"Stelle",null,"Bemerkungen ",null,null,null,"Name",null,"Stelle",null,"Bemerkungen ",null,null,null,"Name",null,"Stelle",null,"Bemerkungen ",null,null,null,"Name",null,"Stelle",null,"Bemerkungen ",null,null,null,"Name",null,"Stelle",null,"Bemerkungen ",null,null,null,"Name",null,"Stelle",null,"Bemerkungen ",null,null,null,"Name",null,"Stelle",null,"Bemerkungen ",null,null,null,"Name",null,"Stelle",null,"Bemerkungen ",null,null,null,"Name",null,"Stelle",null,"Bemerkungen ",null,null,null,"Name",null,"Stelle",null,"Bemerkungen ",null,null,null,"Name",null,"Stelle",null,"Bemerkungen ",null,null,null,"Name",null,"Stelle",null,"Bemerkungen ",null,null,null,"Name",null,"Stelle",null,"Bemerkungen ",null,null,null,"Name",null,"Stelle",null,"Bemerkungen ",null,null,null,"Name",null,"Stelle",null,"Bemerkungen ",null,null,null,"Name",null,"Stelle",null,"Bemerkungen ",null,null,null,"Name",null,"Stelle",null,"Bemerkungen ",null,null,null,"Name",null,"Stelle",null,"Bemerkungen ",null,null,null,"Name",null,"Stelle",null,"Bemerkungen ",null,null,null,"Name",null,"Stelle",null,"Bemerkungen ",null,null,null,"Name",null,"Stelle",null,"Bemerkungen ",null,null,null,"Name",null,"Stelle",null,"Bemerkungen ",null,null,null,"Name",null,"Stelle",null,"Bemerkungen ",null,null,null,"Name",null,"Stelle",null,"Bemerkungen ",null,null,null,"Name",null,"Stelle",null,"Bemerkungen ",null,null,null,"Name",null,"Stelle",null,"Bemerkungen ",null,null,null,"Name",null,"Stelle",null,"Bemerkungen ",null,null,null,"Name",null,"Stelle",null,"Bemerkungen ",null,null,null,"Name",null,"Stelle",null,"Bemerkungen ",null,null,null,"Name",null,"Stelle",null,"Bemerkungen ",null,null,null,"Name",null,"Stelle",null,"Bemerkungen ",null,null,null,"Name",null,"Stelle",null,"Bemerkungen ",null,null,null,"Name",null,"Stelle",null,"Bemerkungen ",null,null,null,"Name",null,"Stelle",null,"Bemerkungen ",null,null,null,"Name",null,"Stelle",null,"Bemerkungen ",null,null,null,"Name",null,"Stelle",null,"Bemerkungen ",null,null,null,"Name",null,"Stelle",null,"Bemerkungen ",null,null,null,"Name",null,"Stelle",null,"Bemerkungen ",null,null,null,"Name",null,"Stelle",null,"Bemerkungen ",null,null,null,"Name",null,"Stelle",null,"Bemerkungen ",null,null,null,"Name",null,"Stelle",null,"Bemerkungen ",null,null,null,"Name",null,"Stelle",null,"Bemerkungen ",null,null,null,"Name",null,"Stelle",null,"Bemerkungen ",null,null,null,"Name",null,"Stelle",null,"Bemerkungen ",null,null,null,"Name",null,"Stelle",null,"Bemerkungen ",null,null,null,"Name",null,"Stelle",null,"Bemerkungen ",null,null,null,"Name",null,"Stelle",null,"Bemerkungen ",null,null,null,"Name",null,"Stelle",null,"Bemerkungen ",null,null,null,"Name",null,"Stelle",null,"Bemerkungen ",null,null,null,"Name",null,"Stelle",null,"Bemerkungen ",null,null,null,"Name",null,"Stelle",null,"Bemerkungen ",null,null,null,"Name",null,"Stelle",null,"Bemerkungen ",null,null,null,"Name",null,"Stelle",null,"Bemerkungen ",null,null,null,"Name",null,"Stelle",null,"Bemerkungen ",null,null,null,"Name",null,"Stelle",null,"Bemerkungen ",null,null,null,"Name",null,"Stelle",null,"Bemerkungen ",null,null,null,"Name",null,"Stelle",null,"Bemerkungen ",null,null,null,"Name",null,"Stelle",null,"Bemerkungen ",null,null,null,"Name",null,"Stelle",null,"Bemerkungen ",null,null,null,"Name",null,"Stelle",null,"Bemerkungen ",null,null,null,"Name",null,"Stelle",null,"Bemerkungen ",null,null,null,"Name",null,"Stelle",null,"Bemerkungen ",null,null,null,"Name",null,"Stelle",null,"Bemerkungen ",null,null,null,"Name",null,"Stelle",null,"Bemerkungen ",null,null,null,"Name",null,"Stelle",null,"Bemerkungen ",null,null,null,"Name",null,"Stelle",null,"Bemerkungen ",null,null,null,"Name",null,"Stelle",null,"Bemerkungen ",null,null,null,"Name",null,"Stelle",null,"Bemerkungen ",null,null,null,"Name",null,"Stelle",null,"Bemerkungen ",null,null,null,"Name",null,"Stelle",null,"Bemerkungen ",null,null,null,"Name",null,"Stelle",null,"Bemerkungen ",null,null,null,"Name",null,"Stelle",null,"Bemerkungen ",null,null,null,"Name",null,"Stelle",null,"Bemerkungen ",null,null,null,"Name",null,"Stelle",null,"Bemerkungen ",null,null,null,"Name",null,"Stelle",null,"Bemerkungen ",null,null,null,"Name",null,"Stelle",null,"Bemerkungen ",null,null,null,"Name",null,"Stelle",null,"Bemerkungen ",null,null,null,"Name",null,"Stelle",null,"Bemerkungen ",null,null,null,"Name",null,"Stelle",null,"Bemerkungen ",null,null,null,"Name",null,"Stelle",null,"Bemerkungen ",null,null,null,"Name",null,"Stelle",null,"Bemerkungen ",null,null,null,"Name",null,"Stelle",null,"Bemerkungen ",null,null,null,"Name",null,"Stelle",null,"Bemerkungen ",null,null,null,"Name",null,"Stelle",null,"Bemerkungen ",null,null,null,"Name",null,"Stelle",null,"Bemerkungen ",null,null,null,"Name",null,"Stelle",null,"Bemerkungen ",null,null,null,"Name",null,"Stelle",null,"Bemerkungen ",null,null,null,"Name",null,"Stelle",null,"Bemerkungen ",null,null,null,"Name",null,"Stelle",null,"Bemerkungen ",null,null,null,"Name",null,"Stelle",null,"Bemerkungen ",null,null,null,"Name",null,"Stelle",null,"Bemerkungen ",null,null,null,"Name",null,"Stelle",null,"Bemerkungen ",null,null,null,"Name",null,"Stelle",null,"Bemerkungen ",null,null,null,"Name",null,"Stelle",null,"Bemerkungen ",null,null,null,"Name",null,"Stelle",null,"Bemerkungen ",null,null,null,"Name",null,"Stelle",null,"Bemerkungen ",null,null,null,"Name",null,"Stelle",null,"Bemerkungen ",null,null,null,"Name",null,"Stelle",null,"Bemerkungen ",null,null,null,"Name",null,"Stelle",null,"Bemerkungen ",null,null,null,"Name",null,"Stelle",null,"Bemerkungen ",null,null,null,"Name",null,"Stelle",null,"Bemerkungen ",null,null,null,"Name",null,"Stelle",null,"Bemerkungen ",null,null,null,"Name",null,"Stelle",null,"Bemerkungen ",null,null,null,"Name",null,"Stelle",null,"Bemerkungen ",null,null,null,"Name",null,"Stelle",null,"Bemerkungen ",null,null,null,"Name",null,"Stelle",null,"Bemerkungen ",null,null,null,"Name",null,"Stelle",null,"Bemerkungen ",null,null,null,"Name",null,"Stelle",null,"Bemerkungen ",null,null,null,"Name",null,"Stelle",null,"Bemerkungen ",null,null,null,"Name",null,"Stelle",null,"Bemerkungen ",null,null,null,"Name",null,"Stelle",null,"Bemerkungen ",null,null,null,"Name",null,"Stelle",null,"Bemerkungen ",null,null,null,"Name",null,"Stelle",null,"Bemerkungen ",null,null,null,"Name",null,"Stelle",null,"Bemerkungen ",null,null,null,"Name",null,"Stelle",null,"Bemerkungen ",null,null,null,"Name",null,"Stelle",null,"Bemerkungen ",null,null,null,"Name",null,"Stelle",null,"Bemerkungen ",null,null,null,"Name",null,"Stelle",null,"Bemerkungen ",null,null,null,"Name",null,"Stelle",null,"Bemerkungen ",null,null,null,"Name",null,"Stelle",null,"Bemerkungen ",null,null,null,"Name",null,"Stelle",null,"Bemerkungen ",null,null,null,"Name",null,"Stelle",null,"Bemerkungen ",null,null,null,"Name",null,"Stelle",null,"Bemerkungen ",null,null,null,"Name",null,"Stelle",null,"Bemerkungen ",null,null,null,"Name",null,"Stelle",null,"Bemerkungen ",null,null,null,"Name",null,"Stelle",null,"Bemerkungen ",null,null,null,"Name",null,"Stelle",null,"Bemerkungen ",null,null,null,"Name",null,"Stelle",null,"Bemerkungen ",null,null,null,"Name",null,"Stelle",null,"Bemerkungen ",null,null,null,"Name",null,"Stelle",null,"Bemerkungen ",null,null,null,"Name",null,"Stelle",null,"Bemerkungen ",null,null,null,"Name",null,"Stelle",null,"Bemerkungen ",null,null,null,"Name",null,"Stelle",null,"Bemerkungen ",null,null,null,"Name",null,"Stelle",null,"Bemerkungen ",null,null,null,"Name",null,"Stelle",null,"Bemerkungen ",null,null,null,"Name",null,"Stelle",null,"Bemerkungen ",null,null,null,"Name",null,"Stelle",null,"Bemerkungen ",null,null,null,"Name",null,"Stelle",null,"Bemerkungen ",null,null,null,"Name",null,"Stelle",null,"Bemerkungen ",null,null,null,"Name",null,"Stelle",null,"Bemerkungen ",null,null,null,"Name",null,"Stelle",null,"Bemerkungen ",null,null,null,"Name",null,"Stelle",null,"Bemerkungen ",null,null,null,"Name",null,"Stelle",null,"Bemerkungen ",null,null,null,"Name",null,"Stelle",null,"Bemerkungen ",null,null,null,"Name",null,"Stelle",null,"Bemerkungen ",null,null,null,"Name",null,"Stelle",null,"Bemerkungen ",null,null,null,"Name",null,"Stelle",null,"Bemerkungen ",null,null,null,"Name",null,"Stelle",null,"Bemerkungen ",null,null,null,"Name",null,"Stelle",null,"Bemerkungen ",null,null,null,"Name",null,"Stelle",null,"Bemerkungen ",null,null,null,"Name",null,"Stelle",null,"Bemerkungen ",null,null,null,"Name",null,"Stelle",null,"Bemerkungen ",null,null,null,"Name",null,"Stelle",null,"Bemerkungen ",null,null,null,"Name",null,"Stelle",null,"Bemerkungen ",null,null,null,"Name",null,"Stelle",null,"Bemerkungen ",null,null,null,"Name",null,"Stelle",null,"Bemerkungen ",null,null,null,"Name",null,"Stelle",null,"Bemerkungen ",null,null,null,"Name",null,"Stelle",null,"Bemerkungen ",null,null,null,"Name",null,"Stelle",null,"Bemerkungen ",null,null,null,"Name",null,"Stelle",null,"Bemerkungen ",null,null,null,"Name",null,"Stelle",null,"Bemerkungen ",null,null,null,"Name",null,"Stelle",null,"Bemerkungen ",null,null,null,"Name",null,"Stelle",null,"Bemerkungen ",null,null,null,"Name",null,"Stelle",null,"Bemerkungen ",null,null,null,"Name",null,"Stelle",null,"Bemerkungen ",null,null,null,"Name",null,"Stelle",null,"Bemerkungen ",null,null,null,"Name",null,"Stelle",null,"Bemerkungen ",null,null,null,"Name",null,"Stelle",null,"Bemerkungen ",null,null,null,"Name",null,"Stelle",null,"Bemerkungen ",null,null,null,"Name",null,"Stelle",null,"Bemerkungen ",null,null,null,"Name",null,"Stelle",null,"Bemerkungen ",null,null,null,"Name",null,"Stelle",null,"Bemerkungen ",null,null,null,"Name",null,"Stelle",null,"Bemerkungen ",null,null,null,"Name",null,"Stelle",null,"Bemerkungen ",null,null,null,"Name",null,"Stelle",null,"Bemerkungen ",null,null,null,"Name",null,"Stelle",null,"Bemerkungen ",null,null,null,"Name",null,"Stelle",null,"Bemerkungen ",null,null,null,"Name",null,"Stelle",null,"Bemerkungen ",null,null,null,"Name",null,"Stelle",null,"Bemerkungen ",null,null,null,"Name",null,"Stelle",null,"Bemerkungen ",null,null,null,"Name",null,"Stelle",null,"Bemerkungen ",null,null,null,"Name",null,"Stelle",null,"Bemerkungen ",null,null,null,"Name",null,"Stelle",null,"Bemerkungen ",null,null,null,"Name",null,"Stelle",null,"Bemerkungen ",null,null,null,"Name",null,"Stelle",null,"Bemerkungen ",null,null,null,"Name",null,"Stelle",null,"Bemerkungen ",null,null,null,"Name",null,"Stelle",null,"Bemerkungen ",null,null,null,"Name",null,"Stelle",null,"Bemerkungen ",null,null,null,"Name",null,"Stelle",null,"Bemerkungen ",null,null,null,"Name",null,"Stelle",null,"Bemerkungen ",null,null,null,"Name",null,"Stelle",null,"Bemerkungen ",null,null,null,"Name",null,"Stelle",null,"Bemerkungen ",null,null,null,"Name",null,"Stelle",null,"Bemerkungen ",null,null,null,"Name",null,"Stelle",null,"Bemerkungen ",null,null,null,"Name",null,"Stelle",null,"Bemerkungen ",null,null,null,"Name",null,"Stelle",null,"Bemerkungen ",null,null,null,"Name",null,"Stelle",null,"Bemerkungen ",null,null,null,"Name",null,"Stelle",null,"Bemerkungen ",null,null,null,"Name",null,"Stelle",null,"Bemerkungen ",null,null,null,"Name",null,"Stelle",null,"Bemerkungen ",null,null,null,"Name",null,"Stelle",null,"Bemerkungen ",null,null,null,"Name",null,"Stelle",null,"Bemerkungen ",null,null,null,"Name",null,"Stelle",null,"Bemerkungen ",null,null,null,"Name",null,"Stelle",null,"Bemerkungen ",null,null,null,"Name",null,"Stelle",null,"Bemerkungen ",null,null,null,"Name",null,"Stelle",null,"Bemerkungen ",null,null,null,"Name",null,"Stelle",null,"Bemerkungen ",null,null,null,"Name",null,"Stelle",null,"Bemerkungen ",null,null,null,"Name",null,"Stelle",null,"Bemerkungen ",null,null,null,"Name",null,"Stelle",null,"Bemerkungen ",null,null,null,"Name",null,"Stelle",null,"Bemerkungen ",null,null,null,"Name",null,"Stelle",null,"Bemerkungen ",null,null,null,"Name",null,"Stelle",null,"Bemerkungen ",null,null,null,"Name",null,"Stelle",null,"Bemerkungen ",null,null,null,"Name",null,"Stelle",null,"Bemerkungen ",null,null,null,"Name",null,"Stelle",null,"Bemerkungen ",null,null,null,"Name",null,"Stelle",null,"Bemerkungen ",null,null,null,"Name",null,"Stelle",null,"Bemerkungen ",null,null,null,"Name",null,"Stelle",null,"Bemerkungen ",null,null,null,"Name",null,"Stelle",null,"Bemerkungen ",null,null,null,"Name",null,"Stelle",null,"Bemerkungen ",null,null,null,"Name",null,"Stelle",null,"Bemerkungen ",null,null,null,"Name",null,"Stelle",null,"Bemerkungen ",null,null,null,"Name",null,"Stelle",null,"Bemerkungen ",null,null,null,"Name",null,"Stelle",null,"Bemerkungen ",null,null,null,"Name",null,"Stelle",null,"Bemerkungen ",null,null,null,"Name",null,"Stelle",null,"Bemerkungen ",null,null,null,"Name",null,"Stelle",null,"Bemerkungen ",null,null,null,"Name",null,"Stelle",null,"Bemerkungen ",null,null,null,"Name",null,"Stelle",null,"Bemerkungen ",null,null,null,"Name",null,"Stelle",null,"Bemerkungen ",null,null,null,"Name",null,"Stelle",null,"Bemerkungen ",null,null,null,"Name",null,"Stelle",null,"Bemerkungen ",null,null,null,"Name",null,"Stelle",null,"Bemerkungen ",null,null,null,"Name",null,"Stelle",null,"Bemerkungen ",null,null,null,"Name",null,"Stelle",null,"Bemerkungen ",null,null,null,"Name",null,"Stelle",null,"Bemerkungen ",null,null,null,"Name",null,"Stelle",null,"Bemerkungen ",null,null,null,"Name",null,"Stelle",null,"Bemerkungen ",null,null,null,"Name",null,"Stelle",null,"Bemerkungen ",null,null,null,"Name",null,"Stelle",null,"Bemerkungen ",null,null,null,"Name",null,"Stelle",null,"Bemerkungen ",null,null,null,"Name",null,"Stelle",null,"Bemerkungen ",null,null,null,"Name",null,"Stelle",null,"Bemerkungen ",null,null,null,"Name",null,"Stelle",null,"Bemerkungen ",null,null,null,"Name",null,"Stelle",null,"Bemerkungen ",null,null,null,"Name",null,"Stelle",null,"Bemerkungen ",null,null,null,"Name",null,"Stelle",null,"Bemerkungen ",null,null,null,"Name",null,"Stelle",null,"Bemerkungen ",null,null,null,"Name",null,"Stelle",null,"Bemerkungen ",null,null,null,"Name",null,"Stelle",null,"Bemerkungen ",null,null,null,"Name",null,"Stelle",null,"Bemerkungen ",null,null,null,"Name",null,"Stelle",null,"Bemerkungen ",null,null,null,"Name",null,"Stelle",null,"Bemerkungen ",null,null,null,"Name",null,"Stelle",null,"Bemerkungen ",null,null,null,"Name",null,"Stelle",null,"Bemerkungen ",null,null,null,"Name",null,"Stelle",null,"Bemerkungen ",null,null,null,"Name",null,"Stelle",null,"Bemerkungen ",null,null,null,"Name",null,"Stelle",null,"Bemerkungen ",null,null,null,"Name",null,"Stelle",null,"Bemerkungen ",null,null,null,"Name",null,"Stelle",null,"Bemerkungen ",null,null,null,"Name",null,"Stelle",null,"Bemerkungen ",null,null,null,"Name",null,"Stelle",null,"Bemerkungen ",null,null,null,"Name",null,"Stelle",null,"Bemerkungen ",null,null,null,"Name",null,"Stelle",null,"Bemerkungen ",null,null,null,"Name",null,"Stelle",null,"Bemerkungen ",null,null,null,"Name",null,"Stelle",null,"Bemerkungen ",null,null,null,"Name",null,"Stelle",null,"Bemerkungen ",null,null,null,"Name",null,"Stelle",null,"Bemerkungen ",null,null,null,"Name",null,"Stelle",null,"Bemerkungen ",null,null,null,"Name",null,"Stelle",null,"Bemerkungen ",null,null,null,"Name",null,"Stelle",null,"Bemerkungen ",null,null,null,"Name",null,"Stelle",null,"Bemerkungen ",null,null,null,"Name",null,"Stelle",null,"Bemerkungen ",null,null,null,"Name",null,"Stelle",null,"Bemerkungen ",null,null,null,"Name",null,"Stelle",null,"Bemerkungen ",null,null,null,"Name",null,"Stelle",null,"Bemerkungen ",null,null,null,"Name",null,"Stelle",null,"Bemerkungen ",null,null,null,"Name",null,"Stelle",null,"Bemerkungen ",null,null,null,"Name",null,"Stelle",null,"Bemerkungen ",null,null,null,"Name",null,"Stelle",null,"Bemerkungen ",null,null,null,"Name",null,"Stelle",null,"Bemerkungen ",null,null,null,"Name",null,"Stelle",null,"Bemerkungen ",null,null,null,"Name",null,"Stelle",null,"Bemerkungen ",null,null,null,"Name",null,"Stelle",null,"Bemerkungen ",null,null,null,"Name",null,"Stelle",null,"Bemerkungen ",null,null,null,"Name",null,"Stelle",null,"Bemerkungen ",null,null,null,"Name",null,"Stelle",null,"Bemerkungen ",null,null,null,"Name",null,"Stelle",null,"Bemerkungen ",null,null,null,"Name",null,"Stelle",null,"Bemerkungen ",null,null,null,"Name",null,"Stelle",null,"Bemerkungen ",null,null,null,"Name",null,"Stelle",null,"Bemerkungen ",null,null,null,"Name",null,"Stelle",null,"Bemerkungen ",null,null,null,"Name",null,"Stelle",null,"Bemerkungen ",null,null,null,"Name",null,"Stelle",null,"Bemerkungen ",null,null,null,"Name",null,"Stelle",null,"Bemerkungen ",null,null,null,"Name",null,"Stelle",null,"Bemerkungen ",null,null,null,"Name",null,"Stelle",null,"Bemerkungen ",null,null,null,"Name",null,"Stelle",null,"Bemerkungen ",null,null,null,"Name",null,"Stelle",null,"Bemerkungen ",null,null,null,"Name",null,"Stelle",null,"Bemerkungen ",null,null,null,"Name",null,"Stelle",null,"Bemerkungen ",null,null,null,"Name",null,"Stelle",null,"Bemerkungen ",null,null,null,"Name",null,"Stelle",null,"Bemerkungen ",null,null,null,"Name",null,"Stelle",null,"Bemerkungen ",null,null,null,"Name",null,"Stelle",null,"Bemerkungen ",null,null,null,"Name",null,"Stelle",null,"Bemerkungen ",null,null,null,"Name",null,"Stelle",null,"Bemerkungen ",null,null,null,"Name",null,"Stelle",null,"Bemerkungen ",null,null,null,"Name",null,"Stelle",null,"Bemerkungen ",null,null,null,"Name",null,"Stelle",null,"Bemerkungen ",null,null,null,"Name",null,"Stelle",null,"Bemerkungen ",null,null,null,"Name",null,"Stelle",null,"Bemerkungen ",null,null,null,"Name",null,"Stelle",null,"Bemerkungen ",null,null,null,"Name",null,"Stelle",null,"Bemerkungen ",null,null,null,"Name",null,"Stelle",null,"Bemerkungen ",null,null,null,"Name",null,"Stelle",null,"Bemerkungen ",null,null,null,"Name",null,"Stelle",null,"Bemerkungen ",null,null,null,"Name",null,"Stelle",null,"Bemerkungen ",null,null,null,"Name",null,"Stelle",null,"Bemerkungen ",null,null,null,"Name",null,"Stelle",null,"Bemerkungen ",null,null,null,"Name",null,"Stelle",null,"Bemerkungen ",null,null,null,"Name",null,"Stelle",null,"Bemerkungen ",null,null,null,"Name",null,"Stelle",null,"Bemerkungen ",null,null,null,"Name",null,"Stelle",null,"Bemerkungen ",null,null,null,"Name",null,"Stelle",null,"Bemerkungen ",null,null,null,"Name",null,"Stelle",null,"Bemerkungen ",null,null,null,"Name",null,"Stelle",null,"Bemerkungen ",null,null,null,"Name",null,"Stelle",null,"Bemerkungen ",null,null,null,"Name",null,"Stelle",null,"Bemerkungen ",null,null,null,"Name",null,"Stelle",null,"Bemerkungen ",null,null,null,"Name",null,"Stelle",null,"Bemerkungen ",null,null,null,"Name",null,"Stelle",null,"Bemerkungen ",null,null,null,"Name",null,"Stelle",null,"Bemerkungen ",null,null,null,"Name",null,"Stelle",null,"Bemerkungen ",null,null,null,"Name",null,"Stelle",null,"Bemerkungen ",null,null,null,"Name",null,"Stelle",null,"Bemerkungen ",null,null,null,"Name",null,"Stelle",null,"Bemerkungen ",null,null,null,"Name",null,"Stelle",null,"Bemerkungen ",null,null,null,"Name",null,"Stelle",null,"Bemerkungen ",null,null,null,"Name",null,"Stelle",null,"Bemerkungen ",null,null,null,"Name",null,"Stelle",null,"Bemerkungen ",null,null,null,"Name",null,"Stelle",null,"Bemerkungen ",null,null,null,"Name",null,"Stelle",null,"Bemerkungen ",null,null,null,"Name",null,"Stelle",null,"Bemerkungen ",null,null,null,"Name",null,"Stelle",null,"Bemerkungen ",null,null,null,"Name",null,"Stelle",null,"Bemerkungen ",null,null,null,"Name",null,"Stelle",null,"Bemerkungen ",null,null,null,"Name",null,"Stelle",null,"Bemerkungen ",null,null,null,"Name",null,"Stelle",null,"Bemerkungen ",null,null,null,"Name",null,"Stelle",null,"Bemerkungen ",null,null,null,"Name",null,"Stelle",null,"Bemerkungen ",null,null,null,"Name",null,"Stelle",null,"Bemerkungen ",null,null,null,"Name",null,"Stelle",null,"Bemerkungen ",null,null,null,"Name",null,"Stelle",null,"Bemerkungen ",null,null,null,"Name",null,"Stelle",null,"Bemerkungen ",null,null,null,"Name",null,"Stelle",null,"Bemerkungen ",null,null,null,"Name",null,"Stelle",null,"Bemerkungen ",null,null,null,"Name",null,"Stelle",null,"Bemerkungen ",null,null,null,"Name",null,"Stelle",null,"Bemerkungen ",null,null,null,"Name",null,"Stelle",null,"Bemerkungen ",null,null,null,"Name",null,"Stelle",null,"Bemerkungen ",null,null,null,"Name",null,"Stelle",null,"Bemerkungen ",null,null,null,"Name",null,"Stelle",null,"Bemerkungen ",null,null,null,"Name",null,"Stelle",null,"Bemerkungen ",null,null,null,"Name",null,"Stelle",null,"Bemerkungen ",null,null,null,"Name",null,"Stelle",null,"Bemerkungen ",null,null,null,"Name",null,"Stelle",null,"Bemerkungen ",null,null,null,"Name",null,"Stelle",null,"Bemerkungen ",null,null,null,"Name",null,"Stelle",null,"Bemerkungen ",null,null,null,"Name",null,"Stelle",null,"Bemerkungen ",null,null,null,"Name",null,"Stelle",null,"Bemerkungen ",null,null,null,"Name",null,"Stelle",null,"Bemerkungen ",null,null,null,"Name",null,"Stelle",null,"Bemerkungen ",null,null,null,"Name",null,"Stelle",null,"Bemerkungen ",null,null,null,"Name",null,"Stelle",null,"Bemerkungen ",null,null,null,"Name",null,"Stelle",null,"Bemerkungen ",null,null,null,"Name",null,"Stelle",null,"Bemerkungen ",null,null,null,"Name",null,"Stelle",null,"Bemerkungen ",null,null,null,"Name",null,"Stelle",null,"Bemerkungen ",null,null,null,"Name",null,"Stelle",null,"Bemerkungen ",null,null,null,"Name",null,"Stelle",null,"Bemerkungen ",null,null,null,"Name",null,"Stelle",null,"Bemerkungen ",null,null,null,"Name",null,"Stelle",null,"Bemerkungen ",null,null,null,"Name",null,"Stelle",null,"Bemerkungen ",null,null,null,"Name",null,"Stelle",null,"Bemerkungen ",null,null,null,"Name",null,"Stelle",null,"Bemerkungen ",null,null,null,"Name",null,"Stelle",null,"Bemerkungen ",null,null,null,"Name",null,"Stelle",null,"Bemerkungen ",null,null,null,"Name",null,"Stelle",null,"Bemerkungen ",null,null,null,"Name",null,"Stelle",null,"Bemerkungen ",null,null,null,"Name",null,"Stelle",null,"Bemerkungen ",null,null,null,"Name",null,"Stelle",null,"Bemerkungen ",null,null,null,"Name",null,"Stelle",null,"Bemerkungen ",null,null,null,"Name",null,"Stelle",null,"Bemerkungen ",null,null,null,"Name",null,"Stelle",null,"Bemerkungen ",null,null,null,"Name",null,"Stelle",null,"Bemerkungen ",null,null,null,"Name",null,"Stelle",null,"Bemerkungen ",null,null,null,"Name",null,"Stelle",null,"Bemerkungen ",null,null,null,"Name",null,"Stelle",null,"Bemerkungen ",null,null,null,"Name",null,"Stelle",null,"Bemerkungen ",null,null,null,"Name",null,"Stelle",null,"Bemerkungen ",null,null,null,"Name",null,"Stelle",null,"Bemerkungen ",null,null,null,"Name",null,"Stelle",null,"Bemerkungen ",null,null,null,"Name",null,"Stelle",null,"Bemerkungen ",null,null,null,"Name",null,"Stelle",null,"Bemerkungen ",null,null,null,"Name",null,"Stelle",null,"Bemerkungen ",null,null,null,"Name",null,"Stelle",null,"Bemerkungen ",null,null,null,"Name",null,"Stelle",null,"Bemerkungen ",null,null,null,"Name",null,"Stelle",null,"Bemerkungen ",null,null,null,"Name",null,"Stelle",null,"Bemerkungen ",null,null,null,"Name",null,"Stelle",null,"Bemerkungen ",null,null,null,"Name",null,"Stelle",null,"Bemerkungen ",null,null,null,"Name",null,"Stelle",null,"Bemerkungen ",null,null,null,"Name",null,"Stelle",null,"Bemerkungen ",null,null,null,"Name",null,"Stelle",null,"Bemerkungen ",null,null,null,"Name",null,"Stelle",null,"Bemerkungen ",null,null,null,"Name",null,"Stelle",null,"Bemerkungen ",null,null,null,"Name",null,"Stelle",null,"Bemerkungen ",null,null,null,"Name",null,"Stelle",null,"Bemerkungen ",null,null,null,"Name",null,"Stelle",null,"Bemerkungen ",null,null,null,"Name",null,"Stelle",null,"Bemerkungen ",null,null,null,"Name",null,"Stelle",null,"Bemerkungen ",null,null,null,"Name",null,"Stelle",null,"Bemerkungen ",null,null,null,"Name",null,"Stelle",null,"Bemerkungen ",null,null,null,"Name",null,"Stelle",null,"Bemerkungen ",null,null,null,"Name",null,"Stelle",null,"Bemerkungen ",null,null,null,"Name",null,"Stelle",null,"Bemerkungen ",null,null,null,"Name",null,"Stelle",null,"Bemerkungen ",null,null,null,"Name",null,"Stelle",null,"Bemerkungen ",null,null,null,"Name",null,"Stelle",null,"Bemerkungen ",null,null,null,"Name",null,"Stelle",null,"Bemerkungen ",null,null,null,"Name",null,"Stelle",null,"Bemerkungen ",null,null,null,"Name",null,"Stelle",null,"Bemerkungen ",null,null,null,"Name",null,"Stelle",null,"Bemerkungen ",null,null,null,"Name",null,"Stelle",null,"Bemerkungen ",null,null,null,"Name",null,"Stelle",null,"Bemerkungen ",null,null,null,"Name",null,"Stelle",null,"Bemerkungen ",null,null,null,"Name",null,"Stelle",null,"Bemerkungen ",null,null,null,"Name",null,"Stelle",null,"Bemerkungen ",null,null,null,"Name",null,"Stelle",null,"Bemerkungen ",null,null,null,"Name",null,"Stelle",null,"Bemerkungen ",null,null,null,"Name",null,"Stelle",null,"Bemerkungen ",null,null,null,"Name",null,"Stelle",null,"Bemerkungen ",null,null,null,"Name",null,"Stelle",null,"Bemerkungen ",null,null,null,"Name",null,"Stelle",null,"Bemerkungen ",null,null,null,"Name",null,"Stelle",null,"Bemerkungen ",null,null,null,"Name",null,"Stelle",null,"Bemerkungen ",null,null,null,"Name",null,"Stelle",null,"Bemerkungen ",null,null,null,"Name",null,"Stelle",null,"Bemerkungen ",null,null,null,"Name",null,"Stelle",null,"Bemerkungen ",null,null,null,"Name",null,"Stelle",null,"Bemerkungen ",null,null,null,"Name",null,"Stelle",null,"Bemerkungen ",null,null,null,"Name",null,"Stelle",null,"Bemerkungen ",null,null,null,"Name",null,"Stelle",null,"Bemerkungen ",null,null,null,"Name",null,"Stelle",null,"Bemerkungen ",null,null,null,"Name",null,"Stelle",null,"Bemerkungen ",null,null,null,"Name",null,"Stelle",null,"Bemerkungen ",null,null,null,"Name",null,"Stelle",null,"Bemerkungen ",null,null,null,"Name",null,"Stelle",null,"Bemerkungen ",null,null,null,"Name",null,"Stelle",null,"Bemerkungen ",null,null,null,"Name",null,"Stelle",null,"Bemerkungen ",null,null,null,"Name",null,"Stelle",null,"Bemerkungen ",null,null,null,"Name",null,"Stelle",null,"Bemerkungen ",null,null,null,"Name",null,"Stelle",null,"Bemerkungen ",null,null,null,"Name",null,"Stelle",null,"Bemerkungen ",null,null,null,"Name",null,"Stelle",null,"Bemerkungen ",null,null,null,"Name",null,"Stelle",null,"Bemerkungen ",null,null,null,"Name",null,"Stelle",null,"Bemerkungen ",null,null,null,"Name",null,"Stelle",null,"Bemerkungen ",null,null,null,"Name",null,"Stelle",null,"Bemerkungen ",null,null,null,"Name",null,"Stelle",null,"Bemerkungen ",null,null,null,"Name",null,"Stelle",null,"Bemerkungen ",null,null,null,"Name",null,"Stelle",null,"Bemerkungen ",null,null,null,"Name",null,"Stelle",null,"Bemerkungen ",null,null,null,"Name",null,"Stelle",null,"Bemerkungen ",null,null,null,"Name",null,"Stelle",null,"Bemerkungen ",null,null,null,"Name",null,"Stelle",null,"Bemerkungen ",null,null,null,"Name",null,"Stelle",null,"Bemerkungen ",null,null,null,"Name",null,"Stelle",null,"Bemerkungen ",null,null,null,"Name",null,"Stelle",null,"Bemerkungen ",null,null,null,"Name",null,"Stelle",null,"Bemerkungen ",null,null,null,"Name",null,"Stelle",null,"Bemerkungen ",null,null,null,"Name",null,"Stelle",null,"Bemerkungen ",null,null,null,"Name",null,"Stelle",null,"Bemerkungen ",null,null,null,"Name",null,"Stelle",null,"Bemerkungen ",null,null,null,"Name",null,"Stelle",null,"Bemerkungen ",null,null,null,"Name",null,"Stelle",null,"Bemerkungen ",null,null,null,"Name",null,"Stelle",null,"Bemerkungen ",null,null,null,"Name",null,"Stelle",null,"Bemerkungen ",null,null,null,"Name",null,"Stelle",null,"Bemerkungen ",null,null,null,"Name",null,"Stelle",null,"Bemerkungen ",null,null,null,"Name",null,"Stelle",null,"Bemerkungen ",null,null,null,"Name",null,"Stelle",null,"Bemerkungen ",null,null,null,"Name",null,"Stelle",null,"Bemerkungen ",null,null,null,"Name",null,"Stelle",null,"Bemerkungen ",null,null,null,"Name",null,"Stelle",null,"Bemerkungen ",null,null,null,"Name",null,"Stelle",null,"Bemerkungen ",null,null,null,"Name",null,"Stelle",null,"Bemerkungen ",null,null,null,"Name",null,"Stelle",null,"Bemerkungen ",null,null,null,"Name",null,"Stelle",null,"Bemerkungen ",null,null,null,"Name",null,"Stelle",null,"Bemerkungen ",null,null,null,"Name",null,"Stelle",null,"Bemerkungen ",null,null,null,"Name",null,"Stelle",null,"Bemerkungen ",null,null,null,"Name",null,"Stelle",null,"Bemerkungen ",null,null,null,"Name",null,"Stelle",null,"Bemerkungen ",null,null,null,"Name",null,"Stelle",null,"Bemerkungen ",null,null,null,"Name",null,"Stelle",null,"Bemerkungen ",null,null,null,"Name",null,"Stelle",null,"Bemerkungen ",null,null,null,"Name",null,"Stelle",null,"Bemerkungen ",null,null,null,"Name",null,"Stelle",null,"Bemerkungen ",null,null,null,"Name",null,"Stelle",null,"Bemerkungen ",null,null,null,"Name",null,"Stelle",null,"Bemerkungen ",null,null,null,"Name",null,"Stelle",null,"Bemerkungen ",null,null,null,"Name",null,"Stelle",null,"Bemerkungen ",null,null,null,"Name",null,"Stelle",null,"Bemerkungen ",null,null,null,"Name",null,"Stelle",null,"Bemerkungen ",null,null,null,"Name",null,"Stelle",null,"Bemerkungen ",null,null,null,"Name",null,"Stelle",null,"Bemerkungen ",null,null,null,"Name",null,"Stelle",null,"Bemerkungen ",null,null,null,"Name",null,"Stelle",null,"Bemerkungen ",null,null,null,"Name",null,"Stelle",null,"Bemerkungen ",null,null,null,"Name",null,"Stelle",null,"Bemerkungen ",null,null,null,"Name",null,"Stelle",null,"Bemerkungen ",null,null,null,"Name",null,"Stelle",null,"Bemerkungen ",null,null,null,"Name",null,"Stelle",null,"Bemerkungen ",null,null,null,"Name",null,"Stelle",null,"Bemerkungen ",null,null,null,"Name",null,"Stelle",null,"Bemerkungen ",null,null,null,"Name",null,"Stelle",null,"Bemerkungen ",null,null,null,"Name",null,"Stelle",null,"Bemerkungen ",null,null,null,"Name",null,"Stelle",null,"Bemerkungen ",null,null,null,"Name",null,"Stelle",null,"Bemerkungen ",null,null,null,"Name",null,"Stelle",null,"Bemerkungen ",null,null,null,"Name",null,"Stelle",null,"Bemerkungen ",null,null,null,"Name",null,"Stelle",null,"Bemerkungen ",null,null,null,"Name",null,"Stelle",null,"Bemerkungen ",null,null,null,"Name",null,"Stelle",null,"Bemerkungen ",null,null,null,"Name",null,"Stelle",null,"Bemerkungen ",null,null,null,"Name",null,"Stelle",null,"Bemerkungen ",null,null,null,"Name",null,"Stelle",null,"Bemerkungen ",null,null,null,"Name",null,"Stelle",null,"Bemerkungen ",null,null,null,"Name",null,"Stelle",null,"Bemerkungen ",null,null,null,"Name",null,"Stelle",null,"Bemerkungen ",null,null,null,"Name",null,"Stelle",null,"Bemerkungen ",null,null,null,"Name",null,"Stelle",null,"Bemerkungen ",null,null,null,"Name",null,"Stelle",null,"Bemerkungen ",null,null,null,"Name",null,"Stelle",null,"Bemerkungen ",null,null,null,"Name",null,"Stelle",null,"Bemerkungen ",null,null,null,"Name",null,"Stelle",null,"Bemerkungen ",null,null,null,"Name",null,"Stelle",null,"Bemerkungen ",null,null,null,"Name",null,"Stelle",null,"Bemerkungen ",null,null,null,"Name",null,"Stelle",null,"Bemerkungen ",null,null,null,"Name",null,"Stelle",null,"Bemerkungen ",null,null,null,"Name",null,"Stelle",null,"Bemerkungen ",null,null,null,"Name",null,"Stelle",null,"Bemerkungen ",null,null,null,"Name",null,"Stelle",null,"Bemerkungen ",null,null,null,"Name",null,"Stelle",null,"Bemerkungen ",null,null,null,"Name",null,"Stelle",null,"Bemerkungen ",null,null,null,"Name",null,"Stelle",null,"Bemerkungen ",null,null,null,"Name",null,"Stelle",null,"Bemerkungen ",null,null,null,"Name",null,"Stelle",null,"Bemerkungen ",null,null,null,"Name",null,"Stelle",null,"Bemerkungen ",null,null,null,"Name",null,"Stelle",null,"Bemerkungen ",null,null,null,"Name",null,"Stelle",null,"Bemerkungen ",null,null,null,"Name",null,"Stelle",null,"Bemerkungen ",null,null,null,"Name",null,"Stelle",null,"Bemerkungen ",null,null,null,"Name",null,"Stelle",null,"Bemerkungen ",null,null,null,"Name",null,"Stelle",null,"Bemerkungen ",null,null,null,"Name",null,"Stelle",null,"Bemerkungen ",null,null,null,"Name",null,"Stelle",null,"Bemerkungen ",null,null,null,"Name",null,"Stelle",null,"Bemerkungen ",null,null,null,"Name",null,"Stelle",null,"Bemerkungen ",null,null,null,"Name",null,"Stelle",null,"Bemerkungen ",null,null,null,"Name",null,"Stelle",null,"Bemerkungen ",null,null,null,"Name",null,"Stelle",null,"Bemerkungen ",null,null,null,"Name",null,"Stelle",null,"Bemerkungen ",null,null,null,"Name",null,"Stelle",null,"Bemerkungen ",null,null,null,"Name",null,"Stelle",null,"Bemerkungen ",null,null,null,"Name",null,"Stelle",null,"Bemerkungen ",null,null,null,"Name",null,"Stelle",null,"Bemerkungen ",null,null,null,"Name",null,"Stelle",null,"Bemerkungen ",null,null,null,"Name",null,"Stelle",null,"Bemerkungen ",null,null,null,"Name",null,"Stelle",null,"Bemerkungen ",null,null,null,"Name",null,"Stelle",null,"Bemerkungen ",null,null,null,"Name",null,"Stelle",null,"Bemerkungen ",null,null,null,"Name",null,"Stelle",null,"Bemerkungen ",null,null,null,"Name",null,"Stelle",null,"Bemerkungen ",null,null,null,"Name",null,"Stelle",null,"Bemerkungen ",null,null,null,"Name",null,"Stelle",null,"Bemerkungen ",null,null,null,"Name",null,"Stelle",null,"Bemerkungen ",null,null,null,"Name",null,"Stelle",null,"Bemerkungen ",null,null,null,"Name",null,"Stelle",null,"Bemerkungen ",null,null,null,"Name",null,"Stelle",null,"Bemerkungen ",null,null,null,"Name",null,"Stelle",null,"Bemerkungen ",null,null,null,"Name",null,"Stelle",null,"Bemerkungen ",null,null,null,"Name",null,"Stelle",null,"Bemerkungen ",null,null,null,"Name",null,"Stelle",null,"Bemerkungen ",null,null,null,"Name",null,"Stelle",null,"Bemerkungen ",null,null,null,"Name",null,"Stelle",null,"Bemerkungen ",null,null,null,"Name",null,"Stelle",null,"Bemerkungen ",null,null,null,"Name",null,"Stelle",null,"Bemerkungen ",null,null,null,"Name",null,"Stelle",null,"Bemerkungen ",null,null,null,"Name",null,"Stelle",null,"Bemerkungen ",null,null,null,"Name",null,"Stelle",null,"Bemerkungen ",null,null,null,"Name",null,"Stelle",null,"Bemerkungen ",null,null,null,"Name",null,"Stelle",null,"Bemerkungen ",null,null,null,"Name",null,"Stelle",null,"Bemerkungen ",null,null,null,"Name",null,"Stelle",null,"Bemerkungen ",null,null,null,"Name",null,"Stelle",null,"Bemerkungen ",null,null,null,"Name",null,"Stelle",null,"Bemerkungen ",null,null,null,"Name",null,"Stelle",null,"Bemerkungen ",null,null,null,"Name",null,"Stelle",null,"Bemerkungen ",null,null,null,"Name",null,"Stelle",null,"Bemerkungen ",null,null,null,"Name",null,"Stelle",null,"Bemerkungen ",null,null,null,"Name",null,"Stelle",null,"Bemerkungen ",null,null,null,"Name",null,"Stelle",null,"Bemerkungen ",null,null,null,"Name",null,"Stelle",null,"Bemerkungen ",null,null,null,"Name",null,"Stelle",null,"Bemerkungen ",null,null,null,"Name",null,"Stelle",null,"Bemerkungen ",null,null,null,"Name",null,"Stelle",null,"Bemerkungen ",null,null,null,"Name",null,"Stelle",null,"Bemerkungen ",null,null,null,"Name",null,"Stelle",null,"Bemerkungen ",null,null,null,"Name",null,"Stelle",null,"Bemerkungen ",null,null,null,"Name",null,"Stelle",null,"Bemerkungen ",null,null,null,"Name",null,"Stelle",null,"Bemerkungen ",null,null,null,"Name",null,"Stelle",null,"Bemerkungen ",null,null,null,"Name",null,"Stelle",null,"Bemerkungen ",null,null,null,"Name",null,"Stelle",null,"Bemerkungen ",null,null,null,"Name",null,"Stelle",null,"Bemerkungen ",null,null,null,"Name",null,"Stelle",null,"Bemerkungen ",null,null,null,"Name",null,"Stelle",null,"Bemerkungen ",null,null,null,"Name",null,"Stelle",null,"Bemerkungen ",null,null,null,"Name",null,"Stelle",null,"Bemerkungen ",null,null,null,"Name",null,"Stelle",null,"Bemerkungen ",null,null,null,"Name",null,"Stelle",null,"Bemerkungen ",null,null,null,"Name",null,"Stelle",null,"Bemerkungen ",null,null,null,"Name",null,"Stelle",null,"Bemerkungen ",null,null,null,"Name",null,"Stelle",null,"Bemerkungen ",null,null,null,"Name",null,"Stelle",null,"Bemerkungen ",null,null,null,"Name",null,"Stelle",null,"Bemerkungen ",null,null,null,"Name",null,"Stelle",null,"Bemerkungen ",null,null,null,"Name",null,"Stelle",null,"Bemerkungen ",null,null,null,"Name",null,"Stelle",null,"Bemerkungen ",null,null,null,"Name",null,"Stelle",null,"Bemerkungen ",null,null,null,"Name",null,"Stelle",null,"Bemerkungen ",null,null,null,"Name",null,"Stelle",null,"Bemerkungen ",null,null,null,"Name",null,"Stelle",null,"Bemerkungen ",null,null,null,"Name",null,"Stelle",null,"Bemerkungen ",null,null,null,"Name",null,"Stelle",null,"Bemerkungen ",null,null,null,"Name",null,"Stelle",null,"Bemerkungen ",null,null,null,"Name",null,"Stelle",null,"Bemerkungen ",null,null,null,"Name",null,"Stelle",null,"Bemerkungen ",null,null,null,"Name",null,"Stelle",null,"Bemerkungen ",null,null,null,"Name",null,"Stelle",null,"Bemerkungen ",null,null,null,"Name",null,"Stelle",null,"Bemerkungen ",null,null,null,"Name",null,"Stelle",null,"Bemerkungen ",null,null,null,"Name",null,"Stelle",null,"Bemerkungen ",null,null,null,"Name",null,"Stelle",null,"Bemerkungen ",null,null,null,"Name",null,"Stelle",null,"Bemerkungen ",null,null,null,"Name",null,"Stelle",null,"Bemerkungen ",null,null,null,"Name",null,"Stelle",null,"Bemerkungen ",null,null,null,"Name",null,"Stelle",null,"Bemerkungen ",null,null,null,"Name",null,"Stelle",null,"Bemerkungen ",null,null,null,"Name",null,"Stelle",null,"Bemerkungen ",null,null,null,"Name",null,"Stelle",null,"Bemerkungen ",null,null,null,"Name",null,"Stelle",null,"Bemerkungen ",null,null,null,"Name",null,"Stelle",null,"Bemerkungen ",null,null,null,"Name",null,"Stelle",null,"Bemerkungen ",null,null,null,"Name",null,"Stelle",null,"Bemerkungen ",null,null,null,"Name",null,"Stelle",null,"Bemerkungen ",null,null,null,"Name",null,"Stelle",null,"Bemerkungen ",null,null,null,"Name",null,"Stelle",null,"Bemerkungen ",null,null,null,"Name",null,"Stelle",null,"Bemerkungen ",null,null,null,"Name",null,"Stelle",null,"Bemerkungen ",null,null,null,"Name",null,"Stelle",null,"Bemerkungen ",null,null,null,"Name",null,"Stelle",null,"Bemerkungen ",null,null,null,"Name",null,"Stelle",null,"Bemerkungen ",null,null,null,"Name",null,"Stelle",null,"Bemerkungen ",null,null,null,"Name",null,"Stelle",null,"Bemerkungen ",null,null,null,"Name",null,"Stelle",null,"Bemerkungen ",null,null,null,"Name",null,"Stelle",null,"Bemerkungen ",null,null,null,"Name",null,"Stelle",null,"Bemerkungen ",null,null,null,"Name",null,"Stelle",null,"Bemerkungen ",null,null,null,"Name",null,"Stelle",null,"Bemerkungen ",null,null,null,"Name",null,"Stelle",null,"Bemerkungen ",null,null,null,"Name",null,"Stelle",null,"Bemerkungen ",null,null,null,"Name",null,"Stelle",null,"Bemerkungen ",null,null,null,"Name",null,"Stelle",null,"Bemerkungen ",null,null,null,"Name",null,"Stelle",null,"Bemerkungen ",null,null,null,"Name",null,"Stelle",null,"Bemerkungen ",null,null,null,"Name",null,"Stelle",null,"Bemerkungen ",null,null,null,"Name",null,"Stelle",null,"Bemerkungen ",null,null,null,"Name",null,"Stelle",null,"Bemerkungen ",null,null,null,"Name",null,"Stelle",null,"Bemerkungen ",null,null,null,"Name",null,"Stelle",null,"Bemerkungen ",null,null,null,"Name",null,"Stelle",null,"Bemerkungen ",null,null,null,"Name",null,"Stelle",null,"Bemerkungen ",null,null,null,"Name",null,"Stelle",null,"Bemerkungen ",null,null,null,"Name",null,"Stelle",null,"Bemerkungen ",null,null,null,"Name",null,"Stelle",null,"Bemerkungen ",null,null,null,"Name",null,"Stelle",null,"Bemerkungen ",null,null,null,"Name",null,"Stelle",null,"Bemerkungen ",null,null,null,"Name",null,"Stelle",null,"Bemerkungen ",null,null,null,"Name",null,"Stelle",null,"Bemerkungen ",null,null,null,"Name",null,"Stelle",null,"Bemerkungen ",null,null,null,"Name",null,"Stelle",null,"Bemerkungen ",null,null,null,"Name",null,"Stelle",null,"Bemerkungen ",null,null,null,"Name",null,"Stelle",null,"Bemerkungen ",null,null,null,"Name",null,"Stelle",null,"Bemerkungen ",null,null,null,"Name",null,"Stelle",null,"Bemerkungen ",null,null,null,"Name",null,"Stelle",null,"Bemerkungen ",null,null,null,"Name",null,"Stelle",null,"Bemerkungen ",null,null,null,"Name",null,"Stelle",null,"Bemerkungen ",null,null,null,"Name",null,"Stelle",null,"Bemerkungen ",null,null,null,"Name",null,"Stelle",null,"Bemerkungen ",null,null,null,"Name",null,"Stelle",null,"Bemerkungen ",null,null,null,"Name",null,"Stelle",null,"Bemerkungen ",null,null,null,"Name",null,"Stelle",null,"Bemerkungen ",null,null,null,"Name",null,"Stelle",null,"Bemerkungen ",null,null,null,"Name",null,"Stelle",null,"Bemerkungen ",null,null,null,"Name",null,"Stelle",null,"Bemerkungen ",null,null,null,"Name",null,"Stelle",null,"Bemerkungen ",null,null,null,"Name",null,"Stelle",null,"Bemerkungen ",null,null,null,"Name",null,"Stelle",null,"Bemerkungen ",null,null,null,"Name",null,"Stelle",null,"Bemerkungen ",null,null,null,"Name",null,"Stelle",null,"Bemerkungen ",null,null,null,"Name",null,"Stelle",null,"Bemerkungen ",null,null,null,"Name",null,"Stelle",null,"Bemerkungen ",null,null,null,"Name",null,"Stelle",null,"Bemerkungen ",null,null,null,"Name",null,"Stelle",null,"Bemerkungen ",null,null,null,"Name",null,"Stelle",null,"Bemerkungen ",null,null,null,"Name",null,"Stelle",null,"Bemerkungen ",null,null,null,"Name",null,"Stelle",null,"Bemerkungen ",null,null,null,"Name",null,"Stelle",null,"Bemerkungen ",null,null,null,"Name",null,"Stelle",null,"Bemerkungen ",null,null,null,"Name",null,"Stelle",null,"Bemerkungen ",null,null,null,"Name",null,"Stelle",null,"Bemerkungen ",null,null,null,"Name",null,"Stelle",null,"Bemerkungen ",null,null,null,"Name",null,"Stelle",null,"Bemerkungen ",null,null,null,"Name",null,"Stelle",null,"Bemerkungen ",null,null,null,"Name",null,"Stelle",null,"Bemerkungen ",null,null,null,"Name",null,"Stelle",null,"Bemerkungen ",null,null,null,"Name",null,"Stelle",null,"Bemerkungen ",null,null,null,"Name",null,"Stelle",null,"Bemerkungen ",null,null,null,"Name",null,"Stelle",null,"Bemerkungen ",null,null,null,"Name",null,"Stelle",null,"Bemerkungen ",null,null,null,"Name",null,"Stelle",null,"Bemerkungen ",null,null,null,"Name",null,"Stelle",null,"Bemerkungen ",null,null,null,"Name",null,"Stelle",null,"Bemerkungen ",null,null,null,"Name",null,"Stelle",null,"Bemerkungen ",null,null,null,"Name",null,"Stelle",null,"Bemerkungen ",null,null,null,"Name",null,"Stelle",null,"Bemerkungen ",null,null,null,"Name",null,"Stelle",null,"Bemerkungen ",null,null,null,"Name",null,"Stelle",null,"Bemerkungen ",null,null,null,"Name",null,"Stelle",null,"Bemerkungen ",null,null,null,"Name",null,"Stelle",null,"Bemerkungen ",null,null,null,"Name",null,"Stelle",null,"Bemerkungen ",null,null,null,"Name",null,"Stelle",null,"Bemerkungen ",null,null,null,"Name",null,"Stelle",null,"Bemerkungen ",null,null,null,"Name",null,"Stelle",null,"Bemerkungen ",null,null,null,"Name",null,"Stelle",null,"Bemerkungen ",null,null,null,"Name",null,"Stelle",null,"Bemerkungen ",null,null,null,"Name",null,"Stelle",null,"Bemerkungen ",null,null,null,"Name",null,"Stelle",null,"Bemerkungen ",null,null,null,"Name",null,"Stelle",null,"Bemerkungen ",null,null,null,"Name",null,"Stelle",null,"Bemerkungen ",null,null,null,"Name",null,"Stelle",null,"Bemerkungen ",null,null,null,"Name",null,"Stelle",null,"Bemerkungen ",null,null,null,"Name",null,"Stelle",null,"Bemerkungen ",null,null,null,"Name",null,"Stelle",null,"Bemerkungen ",null,null,null,"Name",null,"Stelle",null,"Bemerkungen ",null,null,null,"Name",null,"Stelle",null,"Bemerkungen ",null,null,null,"Name",null,"Stelle",null,"Bemerkungen ",null,null,null,"Name",null,"Stelle",null,"Bemerkungen ",null,null,null,"Name",null,"Stelle",null,"Bemerkungen ",null,null,null,"Name",null,"Stelle",null,"Bemerkungen ",null,null,null,"Name",null,"Stelle",null,"Bemerkungen ",null,null,null,"Name",null,"Stelle",null,"Bemerkungen ",null,null,null,"Name",null,"Stelle",null,"Bemerkungen ",null,null,null,"Name",null,"Stelle",null,"Bemerkungen ",null,null,null,"Name",null,"Stelle",null,"Bemerkungen ",null,null,null,"Name",null,"Stelle",null,"Bemerkungen ",null,null,null,"Name",null,"Stelle",null,"Bemerkungen ",null,null,null,"Name",null,"Stelle",null,"Bemerkungen ",null,null,null,"Name",null,"Stelle",null,"Bemerkungen ",null,null,null,"Name",null,"Stelle",null,"Bemerkungen ",null,null,null,"Name",null,"Stelle",null,"Bemerkungen ",null,null,null,"Name",null,"Stelle",null,"Bemerkungen ",null,null,null,"Name",null,"Stelle",null,"Bemerkungen ",null,null,null,"Name",null,"Stelle",null,"Bemerkungen ",null,null,null,"Name",null,"Stelle",null,"Bemerkungen ",null,null,null,"Name",null,"Stelle",null,"Bemerkungen ",null,null,null,"Name",null,"Stelle",null,"Bemerkungen ",null,null,null,"Name",null,"Stelle",null,"Bemerkungen ",null,null,null,"Name",null,"Stelle",null,"Bemerkungen ",null,null,null,"Name",null,"Stelle",null,"Bemerkungen ",null,null,null,"Name",null,"Stelle",null,"Bemerkungen ",null,null,null,"Name",null,"Stelle",null,"Bemerkungen ",null,null,null,"Name",null,"Stelle",null,"Bemerkungen ",null,null,null,"Name",null,"Stelle",null,"Bemerkungen ",null,null,null,"Name",null,"Stelle",null,"Bemerkungen ",null,null,null,"Name",null,"Stelle",null,"Bemerkungen ",null,null,null,"Name",null,"Stelle",null,"Bemerkungen ",null,null,null,"Name",null,"Stelle",null,"Bemerkungen ",null,null,null,"Name",null,"Stelle",null,"Bemerkungen ",null,null,null,"Name",null,"Stelle",null,"Bemerkungen ",null,null,null,"Name",null,"Stelle",null,"Bemerkungen ",null,null,null,"Name",null,"Stelle",null,"Bemerkungen ",null,null,null,"Name",null,"Stelle",null,"Bemerkungen ",null,null,null,"Name",null,"Stelle",null,"Bemerkungen ",null,null,null,"Name",null,"Stelle",null,"Bemerkungen ",null,null,null,"Name",null,"Stelle",null,"Bemerkungen ",null,null,null,"Name",null,"Stelle",null,"Bemerkungen ",null,null,null,"Name",null,"Stelle",null,"Bemerkungen ",null,null,null,"Name",null,"Stelle",null,"Bemerkungen ",null,null,null,"Name",null,"Stelle",null,"Bemerkungen ",null,null,null,"Name",null,"Stelle",null,"Bemerkungen ",null,null,null,"Name",null,"Stelle",null,"Bemerkungen ",null,null,null,"Name",null,"Stelle",null,"Bemerkungen ",null,null,null,"Name",null,"Stelle",null,"Bemerkungen ",null,null,null,"Name",null,"Stelle",null,"Bemerkungen ",null,null,null,"Name",null,"Stelle",null,"Bemerkungen ",null,null,null,"Name",null,"Stelle",null,"Bemerkungen ",null,null,null,"Name",null,"Stelle",null,"Bemerkungen ",null,null,null,"Name",null,"Stelle",null,"Bemerkungen ",null,null,null,"Name",null,"Stelle",null,"Bemerkungen ",null,null,null,"Name",null,"Stelle",null,"Bemerkungen ",null,null,null,"Name",null,"Stelle",null,"Bemerkungen ",null,null,null,"Name",null,"Stelle",null,"Bemerkungen ",null,null,null,"Name",null,"Stelle",null,"Bemerkungen ",null,null,null,"Name",null,"Stelle",null,"Bemerkungen ",null,null,null,"Name",null,"Stelle",null,"Bemerkungen ",null,null,null,"Name",null,"Stelle",null,"Bemerkungen ",null,null,null,"Name",null,"Stelle",null,"Bemerkungen ",null,null,null,"Name",null,"Stelle",null,"Bemerkungen ",null,null,null,"Name",null,"Stelle",null,"Bemerkungen ",null,null,null,"Name",null,"Stelle",null,"Bemerkungen ",null,null,null,"Name",null,"Stelle",null,"Bemerkungen ",null,null,null,"Name",null,"Stelle",null,"Bemerkungen ",null,null,null,"Name",null,"Stelle",null,"Bemerkungen ",null,null,null,"Name",null,"Stelle",null,"Bemerkungen ",null,null,null,"Name",null,"Stelle",null,"Bemerkungen ",null,null,null,"Name",null,"Stelle",null,"Bemerkungen ",null,null,null,"Name",null,"Stelle",null,"Bemerkungen ",null,null,null,"Name",null,"Stelle",null,"Bemerkungen ",null,null,null,"Name",null,"Stelle",null,"Bemerkungen ",null,null,null,"Name",null,"Stelle",null,"Bemerkungen ",null,null,null,"Name",null,"Stelle",null,"Bemerkungen ",null,null,null,"Name",null,"Stelle",null,"Bemerkungen ",null,null,null,"Name",null,"Stelle",null,"Bemerkungen ",null,null,null,"Name",null,"Stelle",null,"Bemerkungen ",null,null,null,"Name",null,"Stelle",null,"Bemerkungen ",null,null,null,"Name",null,"Stelle",null,"Bemerkungen ",null,null,null,"Name",null,"Stelle",null,"Bemerkungen ",null,null,null,"Name",null,"Stelle",null,"Bemerkungen ",null,null,null,"Name",null,"Stelle",null,"Bemerkungen ",null,null,null,"Name",null,"Stelle",null,"Bemerkungen ",null,null,null,"Name",null,"Stelle",null,"Bemerkungen ",null,null,null,"Name",null,"Stelle",null,"Bemerkungen ",null,null,null,"Name",null,"Stelle",null,"Bemerkungen ",null,null,null,"Name",null,"Stelle",null,"Bemerkungen ",null,null,null,"Name",null,"Stelle",null,"Bemerkungen ",null,null,null,"Name",null,"Stelle",null,"Bemerkungen ",null,null,null,"Name",null,"Stelle",null,"Bemerkungen ",null,null,null,"Name",null,"Stelle",null,"Bemerkungen ",null,null,null,"Name",null,"Stelle",null,"Bemerkungen ",null,null,null,"Name",null,"Stelle",null,"Bemerkungen ",null,null,null,"Name",null,"Stelle",null,"Bemerkungen ",null,null,null,"Name",null,"Stelle",null,"Bemerkungen ",null,null,null,"Name",null,"Stelle",null,"Bemerkungen ",null,null,null,"Name",null,"Stelle",null,"Bemerkungen ",null,null,null,"Name",null,"Stelle",null,"Bemerkungen ",null,null,null,"Name",null,"Stelle",null,"Bemerkungen ",null,null,null,"Name",null,"Stelle",null,"Bemerkungen ",null,null,null,"Name",null,"Stelle",null,"Bemerkungen ",null,null,null,"Name",null,"Stelle",null,"Bemerkungen ",null,null,null,"Name",null,"Stelle",null,"Bemerkungen ",null,null,null,"Name",null,"Stelle",null,"Bemerkungen ",null,null,null,"Name",null,"Stelle",null,"Bemerkungen ",null,null,null,"Name",null,"Stelle",null,"Bemerkungen ",null,null,null,"Name",null,"Stelle",null,"Bemerkungen ",null,null,null,"Name",null,"Stelle",null,"Bemerkungen ",null,null,null,"Name",null,"Stelle",null,"Bemerkungen ",null,null,null,"Name",null,"Stelle",null,"Bemerkungen ",null,null,null,"Name",null,"Stelle",null,"Bemerkungen ",null,null,null,"Name",null,"Stelle",null,"Bemerkungen ",null,null,null,"Name",null,"Stelle",null,"Bemerkungen ",null,null,null,"Name",null,"Stelle",null,"Bemerkungen ",null,null,null,"Name",null,"Stelle",null,"Bemerkungen ",null,null,null,"Name",null,"Stelle",null,"Bemerkungen ",null,null,null,"Name",null,"Stelle",null,"Bemerkungen ",null,null,null,"Name",null,"Stelle",null,"Bemerkungen ",null,null,null,"Name",null,"Stelle",null,"Bemerkungen ",null,null,null,"Name",null,"Stelle",null,"Bemerkungen ",null,null,null,"Name",null,"Stelle",null,"Bemerkungen ",null,null,null,"Name",null,"Stelle",null,"Bemerkungen ",null,null,null,"Name",null,"Stelle",null,"Bemerkungen ",null,null,null,"Name",null,"Stelle",null,"Bemerkungen ",null,null,null,"Name",null,"Stelle",null,"Bemerkungen ",null,null,null,"Name",null,"Stelle",null,"Bemerkungen ",null,null,null,"Name",null,"Stelle",null,"Bemerkungen ",null,null,null,"Name",null,"Stelle",null,"Bemerkungen ",null,null,null,"Name",null,"Stelle",null,"Bemerkungen ",null,null,null,"Name",null,"Stelle",null,"Bemerkungen ",null,null,null,"Name",null,"Stelle",null,"Bemerkungen ",null,null,null,"Name",null,"Stelle",null,"Bemerkungen ",null,null,null,"Name",null,"Stelle",null,"Bemerkungen ",null,null,null,"Name",null,"Stelle",null,"Bemerkungen ",null,null,null,"Name",null,"Stelle",null,"Bemerkungen ",null,null,null,"Name",null,"Stelle",null,"Bemerkungen ",null,null,null,"Name",null,"Stelle",null,"Bemerkungen ",null,null,null,"Name",null,"Stelle",null,"Bemerkungen ",null,null,null,"Name",null,"Stelle",null,"Bemerkungen ",null,null,null,"Name",null,"Stelle",null,"Bemerkungen ",null,null,null,"Name",null,"Stelle",null,"Bemerkungen ",null,null,null,"Name",null,"Stelle",null,"Bemerkungen ",null,null,null,"Name",null,"Stelle",null,"Bemerkungen ",null,null,null,"Name",null,"Stelle",null,"Bemerkungen ",null,null,null,"Name",null,"Stelle",null,"Bemerkungen ",null,null,null,"Name",null,"Stelle",null,"Bemerkungen ",null,null,null,"Name",null,"Stelle",null,"Bemerkungen ",null,null,null,"Name",null,"Stelle",null,"Bemerkungen ",null,null,null,"Name",null,"Stelle",null,"Bemerkungen ",null,null,null,"Name",null,"Stelle",null,"Bemerkungen ",null,null,null,"Name",null,"Stelle",null,"Bemerkungen ",null,null,null,"Name",null,"Stelle",null,"Bemerkungen ",null,null,null,"Name",null,"Stelle",null,"Bemerkungen ",null,null,null,"Name",null,"Stelle",null,"Bemerkungen ",null,null,null,"Name",null,"Stelle",null,"Bemerkungen ",null,null,null,"Name",null,"Stelle",null,"Bemerkungen ",null,null,null,"Name",null,"Stelle",null,"Bemerkungen ",null,null,null,"Name",null,"Stelle",null,"Bemerkungen ",null,null,null,"Name",null,"Stelle",null,"Bemerkungen ",null,null,null,"Name",null,"Stelle",null,"Bemerkungen ",null,null,null,"Name",null,"Stelle",null,"Bemerkungen ",null,null,null,"Name",null,"Stelle",null,"Bemerkungen ",null,null,null,"Name",null,"Stelle",null,"Bemerkungen ",null,null,null,"Name",null,"Stelle",null,"Bemerkungen ",null,null,null,"Name",null,"Stelle",null,"Bemerkungen ",null,null,null,"Name",null,"Stelle",null,"Bemerkungen ",null,null,null,"Name",null,"Stelle",null,"Bemerkungen ",null,null,null,"Name",null,"Stelle",null,"Bemerkungen ",null,null,null,"Name",null,"Stelle",null,"Bemerkungen ",null,null,null,"Name",null,"Stelle",null,"Bemerkungen ",null,null,null,"Name",null,"Stelle",null,"Bemerkungen ",null,null,null,"Name",null,"Stelle",null,"Bemerkungen ",null,null,null,"Name",null,"Stelle",null,"Bemerkungen ",null,null,null,"Name",null,"Stelle",null,"Bemerkungen ",null,null,null,"Name",null,"Stelle",null,"Bemerkungen ",null,null,null,"Name",null,"Stelle",null,"Bemerkungen ",null,null,null,"Name",null,"Stelle",null,"Bemerkungen ",null,null,null,"Name",null,"Stelle",null,"Bemerkungen ",null,null,null,"Name",null,"Stelle",null,"Bemerkungen ",null,null,null,"Name",null,"Stelle",null,"Bemerkungen ",null,null,null,"Name",null,"Stelle",null,"Bemerkungen ",null,null,null,"Name",null,"Stelle",null,"Bemerkungen ",null,null,null,"Name",null,"Stelle",null,"Bemerkungen ",null,null,null,"Name",null,"Stelle",null,"Bemerkungen ",null,null,null,"Name",null,"Stelle",null,"Bemerkungen ",null,null,null,"Name",null,"Stelle",null,"Bemerkungen ",null,null,null,"Name",null,"Stelle",null,"Bemerkungen ",null,null,null,"Name",null,"Stelle",null,"Bemerkungen ",null,null,null,"Name",null,"Stelle",null,"Bemerkungen ",null,null,null,"Name",null,"Stelle",null,"Bemerkungen ",null,null,null,"Name",null,"Stelle",null,"Bemerkungen ",null,null,null,"Name",null,"Stelle",null,"Bemerkungen ",null,null,null,"Name",null,"Stelle",null,"Bemerkungen ",null,null,null,"Name",null,"Stelle",null,"Bemerkungen ",null,null,null,"Name",null,"Stelle",null,"Bemerkungen ",null,null,null,"Name",null,"Stelle",null,"Bemerkungen ",null,null,null,"Name",null,"Stelle",null,"Bemerkungen ",null,null,null,"Name",null,"Stelle",null,"Bemerkungen ",null,null,null,"Name",null,"Stelle",null,"Bemerkungen ",null,null,null,"Name",null,"Stelle",null,"Bemerkungen ",null,null,null,"Name",null,"Stelle",null,"Bemerkungen ",null,null,null,"Name",null,"Stelle",null,"Bemerkungen ",null,null,null,"Name",null,"Stelle",null,"Bemerkungen ",null,null,null,"Name",null,"Stelle",null,"Bemerkungen ",null,null,null,"Name",null,"Stelle",null,"Bemerkungen ",null,null,null,"Name",null,"Stelle",null,"Bemerkungen ",null,null,null,"Name",null,"Stelle",null,"Bemerkungen ",null,null,null,"Name",null,"Stelle",null,"Bemerkungen ",null,null,null,"Name",null,"Stelle",null,"Bemerkungen ",null,null,null,"Name",null,"Stelle",null,"Bemerkungen ",null,null,null,"Name",null,"Stelle",null,"Bemerkungen ",null,null,null,"Name",null,"Stelle",null,"Bemerkungen ",null,null,null,"Name",null,"Stelle",null,"Bemerkungen ",null,null,null,"Name",null,"Stelle",null,"Bemerkungen ",null,null,null,"Name",null,"Stelle",null,"Bemerkungen ",null,null,null,"Name",null,"Stelle",null,"Bemerkungen ",null,null,null,"Name",null,"Stelle",null,"Bemerkungen ",null,null,null,"Name",null,"Stelle",null,"Bemerkungen ",null,null,null,"Name",null,"Stelle",null,"Bemerkungen ",null,null,null,"Name",null,"Stelle",null,"Bemerkungen ",null,null,null,"Name",null,"Stelle",null,"Bemerkungen ",null,null,null,"Name",null,"Stelle",null,"Bemerkungen ",null,null,null,"Name",null,"Stelle",null,"Bemerkungen ",null,null,null,"Name",null,"Stelle",null,"Bemerkungen ",null,null,null,"Name",null,"Stelle",null,"Bemerkungen ",null,null,null,"Name",null,"Stelle",null,"Bemerkungen ",null,null,null,"Name",null,"Stelle",null,"Bemerkungen ",null,null,null,"Name",null,"Stelle",null,"Bemerkungen ",null,null,null,"Name",null,"Stelle",null,"Bemerkungen ",null,null,null,"Name",null,"Stelle",null,"Bemerkungen ",null,null,null,"Name",null,"Stelle",null,"Bemerkungen ",null,null,null,"Name",null,"Stelle",null,"Bemerkungen ",null,null,null,"Name",null,"Stelle",null,"Bemerkungen ",null,null,null,"Name",null,"Stelle",null,"Bemerkungen ",null,null,null,"Name",null,"Stelle",null,"Bemerkungen ",null,null,null,"Name",null,"Stelle",null,"Bemerkungen ",null,null,null,"Name",null,"Stelle",null,"Bemerkungen ",null,null,null,"Name",null,"Stelle",null,"Bemerkungen ",null,null,null,"Name",null,"Stelle",null,"Bemerkungen ",null,null,null,"Name",null,"Stelle",null,"Bemerkungen ",null,null,null,"Name",null,"Stelle",null,"Bemerkungen ",null,null,null,"Name",null,"Stelle",null,"Bemerkungen ",null,null,null,"Name",null,"Stelle",null,"Bemerkungen ",null,null,null,"Name",null,"Stelle",null,"Bemerkungen ",null,null,null,"Name",null,"Stelle",null,"Bemerkungen ",null,null,null,"Name",null,"Stelle",null,"Bemerkungen ",null,null,null,"Name",null,"Stelle",null,"Bemerkungen ",null,null,null,"Name",null,"Stelle",null,"Bemerkungen ",null,null,null,"Name",null,"Stelle",null,"Bemerkungen ",null,null,null,"Name",null,"Stelle",null,"Bemerkungen ",null,null,null,"Name",null,"Stelle",null,"Bemerkungen ",null,null,null,"Name",null,"Stelle",null,"Bemerkungen ",null,null,null,"Name",null,"Stelle",null,"Bemerkungen ",null,null,null,"Name",null,"Stelle",null,"Bemerkungen ",null,null,null,"Name",null,"Stelle",null,"Bemerkungen ",null,null,null,"Name",null,"Stelle",null,"Bemerkungen ",null,null,null,"Name",null,"Stelle",null,"Bemerkungen ",null,null,null,"Name",null,"Stelle",null,"Bemerkungen ",null,null,null,"Name",null,"Stelle",null,"Bemerkungen ",null,null,null,"Name",null,"Stelle",null,"Bemerkungen ",null,null,null,"Name",null,"Stelle",null,"Bemerkungen ",null,null,null,"Name",null,"Stelle",null,"Bemerkungen ",null,null,null,"Name",null,"Stelle",null,"Bemerkungen ",null,null,null,"Name",null,"Stelle",null,"Bemerkungen ",null,null,null,"Name",null,"Stelle",null,"Bemerkungen ",null,null,null,"Name",null,"Stelle",null,"Bemerkungen ",null,null,null,"Name",null,"Stelle",null,"Bemerkungen ",null,null,null,"Name",null,"Stelle",null,"Bemerkungen ",null,null,null,"Name",null,"Stelle",null,"Bemerkungen ",null,null,null,"Name",null,"Stelle",null,"Bemerkungen ",null,null,null,"Name",null,"Stelle",null,"Bemerkungen ",null,null,null,"Name",null,"Stelle",null,"Bemerkungen ",null,null,null,"Name",null,"Stelle",null,"Bemerkungen ",null,null,null,"Name",null,"Stelle",null,"Bemerkungen ",null,null,null,"Name",null,"Stelle",null,"Bemerkungen ",null,null,null,"Name",null,"Stelle",null,"Bemerkungen ",null,null,null,"Name",null,"Stelle",null,"Bemerkungen ",null,null,null,"Name",null,"Stelle",null,"Bemerkungen ",null,null,null,"Name",null,"Stelle",null,"Bemerkungen ",null,null,null,"Name",null,"Stelle",null,"Bemerkungen ",null,null,null,"Name",null,"Stelle",null,"Bemerkungen ",null,null,null,"Name",null,"Stelle",null,"Bemerkungen ",null,null,null,"Name",null,"Stelle",null,"Bemerkungen ",null,null,null,"Name",null,"Stelle",null,"Bemerkungen ",null,null,null,"Name",null,"Stelle",null,"Bemerkungen ",null,null,null,"Name",null,"Stelle",null,"Bemerkungen ",null,null,null,"Name",null,"Stelle",null,"Bemerkungen ",null,null,null,"Name",null,"Stelle",null,"Bemerkungen ",null,null,null,"Name",null,"Stelle",null,"Bemerkungen ",null,null,null,"Name",null,"Stelle",null,"Bemerkungen ",null,null,null,"Name",null,"Stelle",null,"Bemerkungen ",null,null,null,"Name",null,"Stelle",null,"Bemerkungen ",null,null,null,"Name",null,"Stelle",null,"Bemerkungen ",null,null,null,"Name",null,"Stelle",null,"Bemerkungen ",null,null,null,"Name",null,"Stelle",null,"Bemerkungen ",null,null,null,"Name",null,"Stelle",null,"Bemerkungen ",null,null,null,"Name",null,"Stelle",null,"Bemerkungen ",null,null,null,"Name",null,"Stelle",null,"Bemerkungen ",null,null,null,"Name",null,"Stelle",null,"Bemerkungen ",null,null,null,"Name",null,"Stelle",null,"Bemerkungen ",null,null,null,"Name",null,"Stelle",null,"Bemerkungen ",null,null,null,"Name",null,"Stelle",null,"Bemerkungen ",null,null,null,"Name",null,"Stelle",null,"Bemerkungen ",null,null,null,"Name",null,"Stelle",null,"Bemerkungen ",null,null,null,"Name",null,"Stelle",null,"Bemerkungen ",null,null,null,"Name",null,"Stelle",null,"Bemerkungen ",null,null,null,"Name",null,"Stelle",null,"Bemerkungen ",null,null,null,"Name",null,"Stelle",null,"Bemerkungen ",null,null,null,"Name",null,"Stelle",null,"Bemerkungen ",null,null,null,"Name",null,"Stelle",null,"Bemerkungen ",null,null,null,"Name",null,"Stelle",null,"Bemerkungen ",null,null,null,"Name",null,"Stelle",null,"Bemerkungen ",null,null,null,"Name",null,"Stelle",null,"Bemerkungen ",null,null,null,"Name",null,"Stelle",null,"Bemerkungen ",null,null,null,"Name",null,"Stelle",null,"Bemerkungen ",null,null,null,"Name",null,"Stelle",null,"Bemerkungen ",null,null,null,"Name",null,"Stelle",null,"Bemerkungen ",null,null,null,"Name",null,"Stelle",null,"Bemerkungen ",null,null,null,"Name",null,"Stelle",null,"Bemerkungen ",null,null,null,"Name",null,"Stelle",null,"Bemerkungen ",null,null,null,"Name",null,"Stelle",null,"Bemerkungen ",null,null,null,"Name",null,"Stelle",null,"Bemerkungen ",null,null,null,"Name",null,"Stelle",null,"Bemerkungen ",null,null,null,"Name",null,"Stelle",null,"Bemerkungen ",null,null,null,"Name",null,"Stelle",null,"Bemerkungen ",null,null,null,"Name",null,"Stelle",null,"Bemerkungen ",null,null,null,"Name",null,"Stelle",null,"Bemerkungen ",null,null,null,"Name",null,"Stelle",null,"Bemerkungen ",null,null,null,"Name",null,"Stelle",null,"Bemerkungen ",null,null,null,"Name",null,"Stelle",null,"Bemerkungen ",null,null,null,"Name",null,"Stelle",null,"Bemerkungen ",null,null,null,"Name",null,"Stelle",null,"Bemerkungen ",null,null,null,"Name",null,"Stelle",null,"Bemerkungen ",null,null,null,"Name",null,"Stelle",null,"Bemerkungen ",null,null,null,"Name",null,"Stelle",null,"Bemerkungen ",null,null,null,"Name",null,"Stelle",null,"Bemerkungen ",null,null,null,"Name",null,"Stelle",null,"Bemerkungen ",null,null,null,"Name",null,"Stelle",null,"Bemerkungen ",null,null,null,"Name",null,"Stelle",null,"Bemerkungen ",null,null,null,"Name",null,"Stelle",null,"Bemerkungen ",null,null,null,"Name",null,"Stelle",null,"Bemerkungen ",null,null,null,"Name",null,"Stelle",null,"Bemerkungen ",null,null,null,"Name",null,"Stelle",null,"Bemerkungen ",null,null,null,"Name",null,"Stelle",null,"Bemerkungen ",null,null,null,"Name",null,"Stelle",null,"Bemerkungen ",null,null,null,"Name",null,"Stelle",null,"Bemerkungen ",null,null,null,"Name",null,"Stelle",null,"Bemerkungen ",null,null,null,"Name",null,"Stelle",null,"Bemerkungen ",null,null,null,"Name",null,"Stelle",null,"Bemerkungen ",null,null,null,"Name",null,"Stelle",null,"Bemerkungen ",null,null,null,"Name",null,"Stelle",null,"Bemerkungen ",null,null,null,"Name",null,"Stelle",null,"Bemerkungen ",null,null,null,"Name",null,"Stelle",null,"Bemerkungen ",null,null,null,"Name",null,"Stelle",null,"Bemerkungen ",null,null,null,"Name",null,"Stelle",null,"Bemerkungen ",null,null,null,"Name",null,"Stelle",null,"Bemerkungen ",null,null,null,"Name",null,"Stelle",null,"Bemerkungen ",null,null,null,"Name",null,"Stelle",null,"Bemerkungen ",null,null,null,"Name",null,"Stelle",null,"Bemerkungen ",null,null,null,"Name",null,"Stelle",null,"Bemerkungen ",null,null,null,"Name",null,"Stelle",null,"Bemerkungen ",null,null,null,"Name",null,"Stelle",null,"Bemerkungen ",null,null,null,"Name",null,"Stelle",null,"Bemerkungen ",null,null,null,"Name",null,"Stelle",null,"Bemerkungen ",null,null,null,"Name",null,"Stelle",null,"Bemerkungen ",null,null,null,"Name",null,"Stelle",null,"Bemerkungen ",null,null,null,"Name",null,"Stelle",null,"Bemerkungen ",null,null,null,"Name",null,"Stelle",null,"Bemerkungen ",null,null,null,"Name",null,"Stelle",null,"Bemerkungen ",null,null,null,"Name",null,"Stelle",null,"Bemerkungen ",null,null,null,"Name",null,"Stelle",null,"Bemerkungen ",null,null,null,"Name",null,"Stelle",null,"Bemerkungen ",null,null,null,"Name",null,"Stelle",null,"Bemerkungen ",null,null,null,"Name",null,"Stelle",null,"Bemerkungen ",null,null,null,"Name",null,"Stelle",null,"Bemerkungen ",null,null,null,"Name",null,"Stelle",null,"Bemerkungen ",null,null,null,"Name",null,"Stelle",null,"Bemerkungen ",null,null,null,"Name",null,"Stelle",null,"Bemerkungen ",null,null,null,"Name",null,"Stelle",null,"Bemerkungen ",null,null,null,"Name",null,"Stelle",null,"Bemerkungen ",null,null,null,"Name",null,"Stelle",null,"Bemerkungen ",null,null,null,"Name",null,"Stelle",null,"Bemerkungen ",null,null,null,"Name",null,"Stelle",null,"Bemerkungen ",null,null,null,"Name",null,"Stelle",null,"Bemerkungen ",null,null,null,"Name",null,"Stelle",null,"Bemerkungen ",null,null,null,"Name",null,"Stelle",null,"Bemerkungen ",null,null,null,"Name",null,"Stelle",null,"Bemerkungen ",null,null,null,"Name",null,"Stelle",null,"Bemerkungen ",null,null,null,"Name",null,"Stelle",null,"Bemerkungen ",null,null,null,"Name",null,"Stelle",null,"Bemerkungen ",null,null,null,"Name",null,"Stelle",null,"Bemerkungen ",null,null,null,"Name",null,"Stelle",null,"Bemerkungen ",null,null,null,"Name",null,"Stelle",null,"Bemerkungen ",null,null,null,"Name",null,"Stelle",null,"Bemerkungen ",null,null,null,"Name",null,"Stelle",null,"Bemerkungen ",null,null,null,"Name",null,"Stelle",null,"Bemerkungen ",null,null,null,"Name",null,"Stelle",null,"Bemerkungen ",null,null,null,"Name",null,"Stelle",null,"Bemerkungen ",null,null,null,"Name",null,"Stelle",null,"Bemerkungen ",null,null,null,"Name",null,"Stelle",null,"Bemerkungen ",null,null,null,"Name",null,"Stelle",null,"Bemerkungen ",null,null,null,"Name",null,"Stelle",null,"Bemerkungen ",null,null,null,"Name",null,"Stelle",null,"Bemerkungen ",null,null,null,"Name",null,"Stelle",null,"Bemerkungen ",null,null,null,"Name",null,"Stelle",null,"Bemerkungen ",null,null,null,"Name",null,"Stelle",null,"Bemerkungen ",null,null,null,"Name",null,"Stelle",null,"Bemerkungen ",null,null,null,"Name",null,"Stelle",null,"Bemerkungen ",null,null,null,"Name",null,"Stelle",null,"Bemerkungen ",null,null,null,"Name",null,"Stelle",null,"Bemerkungen ",null,null,null,"Name",null,"Stelle",null,"Bemerkungen ",null,null,null,"Name",null,"Stelle",null,"Bemerkungen ",null,null,null,"Name",null,"Stelle",null,"Bemerkungen ",null,null,null,"Name",null,"Stelle",null,"Bemerkungen ",null,null,null,"Name",null,"Stelle",null,"Bemerkungen ",null,null,null,"Name",null,"Stelle",null,"Bemerkungen ",null,null,null,"Name",null,"Stelle",null,"Bemerkungen ",null,null,null,"Name",null,"Stelle",null,"Bemerkungen ",null,null,null,"Name",null,"Stelle",null,"Bemerkungen ",null,null,null,"Name",null,"Stelle",null,"Bemerkungen ",null,null,null,"Name",null,"Stelle",null,"Bemerkungen ",null,null,null,"Name",null,"Stelle",null,"Bemerkungen ",null,null,null,"Name",null,"Stelle",null,"Bemerkungen ",null,null,null,"Name",null,"Stelle",null,"Bemerkungen ",null,null,null,"Name",null,"Stelle",null,"Bemerkungen ",null,null,null,"Name",null,"Stelle",null,"Bemerkungen ",null,null,null,"Name",null,"Stelle",null,"Bemerkungen ",null,null,null,"Name",null,"Stelle",null,"Bemerkungen ",null,null,null,"Name",null,"Stelle",null,"Bemerkungen ",null,null,null,"Name",null,"Stelle",null,"Bemerkungen ",null,null,null,"Name",null,"Stelle",null,"Bemerkungen ",null,null,null,"Name",null,"Stelle",null,"Bemerkungen ",null,null,null,"Name",null,"Stelle",null,"Bemerkungen ",null,null,null,"Name",null,"Stelle",null,"Bemerkungen ",null,null,null,"Name",null,"Stelle",null,"Bemerkungen ",null,null,null,"Name",null,"Stelle",null,"Bemerkungen ",null,null,null,"Name",null,"Stelle",null,"Bemerkungen ",null,null,null,"Name",null,"Stelle",null,"Bemerkungen ",null,null,null,"Name",null,"Stelle",null,"Bemerkungen ",null,null,null,"Name",null,"Stelle",null,"Bemerkungen ",null,null,null,"Name",null,"Stelle",null,"Bemerkungen ",null,null,null,"Name",null,"Stelle",null,"Bemerkungen ",null,null,null,"Name",null,"Stelle",null,"Bemerkungen ",null,null,null,"Name",null,"Stelle",null,"Bemerkungen ",null,null,null,"Name",null,"Stelle",null,"Bemerkungen ",null,null,null,"Name",null,"Stelle",null,"Bemerkungen ",null,null,null,"Name",null,"Stelle",null,"Bemerkungen ",null,null,null,"Name",null,"Stelle",null,"Bemerkungen ",null,null,null,"Name",null,"Stelle",null,"Bemerkungen ",null,null,null,"Name",null,"Stelle",null,"Bemerkungen ",null,null,null,"Name",null,"Stelle",null,"Bemerkungen ",null,null,null,"Name",null,"Stelle",null,"Bemerkungen ",null,null,null,"Name",null,"Stelle",null,"Bemerkungen ",null,null,null,"Name",null,"Stelle",null,"Bemerkungen ",null,null,null,"Name",null,"Stelle",null,"Bemerkungen ",null,null,null,"Name",null,"Stelle",null,"Bemerkungen ",null,null,null,"Name",null,"Stelle",null,"Bemerkungen ",null,null,null,"Name",null,"Stelle",null,"Bemerkungen ",null,null,null,"Name",null,"Stelle",null,"Bemerkungen ",null,null,null,"Name",null,"Stelle",null,"Bemerkungen ",null,null,null,"Name",null,"Stelle",null,"Bemerkungen ",null,null,null,"Name",null,"Stelle",null,"Bemerkungen ",null,null,null,"Name",null,"Stelle",null,"Bemerkungen ",null,null,null,"Name",null,"Stelle",null,"Bemerkungen ",null,null,null,"Name",null,"Stelle",null,"Bemerkungen ",null,null,null,"Name",null,"Stelle",null,"Bemerkungen ",null,null,null,"Name",null,"Stelle",null,"Bemerkungen ",null,null,null,"Name",null,"Stelle",null,"Bemerkungen ",null,null,null,"Name",null,"Stelle",null,"Bemerkungen ",null,null,null,"Name",null,"Stelle",null,"Bemerkungen ",null,null,null,"Name",null,"Stelle",null,"Bemerkungen ",null,null,null,"Name",null,"Stelle",null,"Bemerkungen ",null,null,null,"Name",null,"Stelle",null,"Bemerkungen ",null,null,null,"Name",null,"Stelle",null,"Bemerkungen ",null,null,null,"Name",null,"Stelle",null,"Bemerkungen ",null,null,null,"Name",null,"Stelle",null,"Bemerkungen ",null,null,null,"Name",null,"Stelle",null,"Bemerkungen ",null,null,null,"Name",null,"Stelle",null,"Bemerkungen ",null,null,null,"Name",null,"Stelle",null,"Bemerkungen ",null,null,null,"Name",null,"Stelle",null,"Bemerkungen ",null,null,null,"Name",null,"Stelle",null,"Bemerkungen ",null,null,null,"Name",null,"Stelle",null,"Bemerkungen ",null,null,null,"Name",null,"Stelle",null,"Bemerkungen ",null,null,null,"Name",null,"Stelle",null,"Bemerkungen ",null,null,null,"Name",null,"Stelle",null,"Bemerkungen ",null,null,null,"Name",null,"Stelle",null,"Bemerkungen ",null,null,null,"Name",null,"Stelle",null,"Bemerkungen ",null,null,null,"Name",null,"Stelle",null,"Bemerkungen ",null,null,null,"Name",null,"Stelle",null,"Bemerkungen ",null,null,null,"Name",null,"Stelle",null,"Bemerkungen ",null,null,null,"Name",null,"Stelle",null,"Bemerkungen ",null,null,null,"Name",null,"Stelle",null,"Bemerkungen ",null,null,null,"Name",null,"Stelle",null,"Bemerkungen ",null,null,null,"Name",null,"Stelle",null,"Bemerkungen ",null,null,null,"Name",null,"Stelle",null,"Bemerkungen ",null,null,null,"Name",null,"Stelle",null,"Bemerkungen ",null,null,null,"Name",null,"Stelle",null,"Bemerkungen ",null,null,null,"Name",null,"Stelle",null,"Bemerkungen ",null,null,null,"Name",null,"Stelle",null,"Bemerkungen ",null,null,null,"Name",null,"Stelle",null,"Bemerkungen ",null,null,null,"Name",null,"Stelle",null,"Bemerkungen ",null,null,null,"Name",null,"Stelle",null,"Bemerkungen ",null,null,null,"Name",null,"Stelle",null,"Bemerkungen ",null,null,null,"Name",null,"Stelle",null,"Bemerkungen ",null,null,null,"Name",null,"Stelle",null,"Bemerkungen ",null,null,null,"Name",null,"Stelle",null,"Bemerkungen ",null,null,null,"Name",null,"Stelle",null,"Bemerkungen ",null,null,null,"Name",null,"Stelle",null,"Bemerkungen ",null,null,null,"Name",null,"Stelle",null,"Bemerkungen ",null,null,null,"Name",null,"Stelle",null,"Bemerkungen ",null,null,null,"Name",null,"Stelle",null,"Bemerkungen ",null,null,null,"Name",null,"Stelle",null,"Bemerkungen ",null,null,null,"Name",null,"Stelle",null,"Bemerkungen ",null,null,null,"Name",null,"Stelle",null,"Bemerkungen ",null,null,null,"Name",null,"Stelle",null,"Bemerkungen ",null,null,null,"Name",null,"Stelle",null,"Bemerkungen ",null,null,null,"Name",null,"Stelle",null,"Bemerkungen ",null,null,null,"Name",null,"Stelle",null,"Bemerkungen ",null,null,null,"Name",null,"Stelle",null,"Bemerkungen ",null,null,null,"Name",null,"Stelle",null,"Bemerkungen ",null,null,null,"Name",null,"Stelle",null,"Bemerkungen ",null,null,null,"Name",null,"Stelle",null,"Bemerkungen ",null,null,null,"Name",null,"Stelle",null,"Bemerkungen ",null,null,null,"Name",null,"Stelle",null,"Bemerkungen ",null,null,null,"Name",null,"Stelle",null,"Bemerkungen ",null,null,null,"Name",null,"Stelle",null,"Bemerkungen ",null,null,null,"Name",null,"Stelle",null,"Bemerkungen ",null,null,null,"Name",null,"Stelle",null,"Bemerkungen ",null,null,null,"Name",null,"Stelle",null,"Bemerkungen ",null,null,null,"Name",null,"Stelle",null,"Bemerkungen ",null,null,null,"Name",null,"Stelle",null,"Bemerkungen ",null,null,null,"Name",null,"Stelle",null,"Bemerkungen ",null,null,null,"Name",null,"Stelle",null,"Bemerkungen ",null,null,null,"Name",null,"Stelle",null,"Bemerkungen ",null,null,null,"Name",null,"Stelle",null,"Bemerkungen ",null,null,null,"Name",null,"Stelle",null,"Bemerkungen ",null,null,null,"Name",null,"Stelle",null,"Bemerkungen ",null,null,null,"Name",null,"Stelle",null,"Bemerkungen ",null,null,null,"Name",null,"Stelle",null,"Bemerkungen ",null,null,null,"Name",null,"Stelle",null,"Bemerkungen ",null,null,null,"Name",null,"Stelle",null,"Bemerkungen ",null,null,null,"Name",null,"Stelle",null,"Bemerkungen ",null,null,null,"Name",null,"Stelle",null,"Bemerkungen ",null,null,null,"Name",null,"Stelle",null,"Bemerkungen ",null,null,null,"Name",null,"Stelle",null,"Bemerkungen ",null,null,null,"Name",null,"Stelle",null,"Bemerkungen ",null,null,null,"Name",null,"Stelle",null,"Bemerkungen ",null,null,null,"Name",null,"Stelle",null,"Bemerkungen ",null,null,null,"Name",null,"Stelle",null,"Bemerkungen ",null,null,null,"Name",null,"Stelle",null,"Bemerkungen ",null,null,null,"Name",null,"Stelle",null,"Bemerkungen ",null,null,null,"Name",null,"Stelle",null,"Bemerkungen ",null,null,null,"Name",null,"Stelle",null,"Bemerkungen ",null,null,null,"Name",null,"Stelle",null,"Bemerkungen ",null,null,null,"Name",null,"Stelle",null,"Bemerkungen ",null,null,null,"Name",null,"Stelle",null,"Bemerkungen ",null,null,null,"Name",null,"Stelle",null,"Bemerkungen ",null,null,null,"Name",null,"Stelle",null,"Bemerkungen ",null,null,null,"Name",null,"Stelle",null,"Bemerkungen ",null,null,null,"Name",null,"Stelle",null,"Bemerkungen ",null,null,null,"Name",null,"Stelle",null,"Bemerkungen ",null,null,null,"Name",null,"Stelle",null,"Bemerkungen ",null,null,null,"Name",null,"Stelle",null,"Bemerkungen ",null,null,null,"Name",null,"Stelle",null,"Bemerkungen ",null,null,null,"Name",null,"Stelle",null,"Bemerkungen ",null,null,null,"Name",null,"Stelle",null,"Bemerkungen ",null,null,null,"Name",null,"Stelle",null,"Bemerkungen ",null,null,null,"Name",null,"Stelle",null,"Bemerkungen ",null,null,null,"Name",null,"Stelle",null,"Bemerkungen ",null,null,null,"Name",null,"Stelle",null,"Bemerkungen ",null,null,null,"Name",null,"Stelle",null,"Bemerkungen ",null,null,null,"Name",null,"Stelle",null,"Bemerkungen ",null,null,null,"Name",null,"Stelle",null,"Bemerkungen ",null,null,null,"Name",null,"Stelle",null,"Bemerkungen ",null,null,null,"Name",null,"Stelle",null,"Bemerkungen ",null,null,null,"Name",null,"Stelle",null,"Bemerkungen ",null,null,null,"Name",null,"Stelle",null,"Bemerkungen ",null,null,null,"Name",null,"Stelle",null,"Bemerkungen ",null,null,null,"Name",null,"Stelle",null,"Bemerkungen ",null,null,null,"Name",null,"Stelle",null,"Bemerkungen ",null,null,null,"Name",null,"Stelle",null,"Bemerkungen ",null,null,null,"Name",null,"Stelle",null,"Bemerkungen ",null,null,null,"Name",null,"Stelle",null,"Bemerkungen ",null,null,null,"Name",null,"Stelle",null,"Bemerkungen ",null,null,null,"Name",null,"Stelle",null,"Bemerkungen ",null,null,null,"Name",null,"Stelle",null,"Bemerkungen ",null,null,null,"Name",null,"Stelle",null,"Bemerkungen ",null,null,null,"Name",null,"Stelle",null,"Bemerkungen ",null,null,null,"Name",null,"Stelle",null,"Bemerkungen ",null,null,null,"Name",null,"Stelle",null,"Bemerkungen ",null,null,null,"Name",null,"Stelle",null,"Bemerkungen ",null,null,null,"Name",null,"Stelle",null,"Bemerkungen ",null,null,null,"Name",null,"Stelle",null,"Bemerkungen ",null,null,null,"Name",null,"Stelle",null,"Bemerkungen ",null,null,null,"Name",null,"Stelle",null,"Bemerkungen ",null,null,null,"Name",null,"Stelle",null,"Bemerkungen ",null,null,null,"Name",null,"Stelle",null,"Bemerkungen ",null,null,null,"Name",null,"Stelle",null,"Bemerkungen ",null,null,null,"Name",null,"Stelle",null,"Bemerkungen ",null,null,null,"Name",null,"Stelle",null,"Bemerkungen ",null,null,null,"Name",null,"Stelle",null,"Bemerkungen ",null,null,null,"Name",null,"Stelle",null,"Bemerkungen ",null,null,null,"Name",null,"Stelle",null,"Bemerkungen ",null,null,null,"Name",null,"Stelle",null,"Bemerkungen ",null,null,null,"Name",null,"Stelle",null,"Bemerkungen ",null,null,null,"Name",null,"Stelle",null,"Bemerkungen ",null,null,null,"Name",null,"Stelle",null,"Bemerkungen ",null,null,null,"Name",null,"Stelle",null,"Bemerkungen ",null,null,null,"Name",null,"Stelle",null,"Bemerkungen ",null,null,null,"Name",null,"Stelle",null,"Bemerkungen ",null,null,null,"Name",null,"Stelle",null,"Bemerkungen ",null,null,null,"Name",null,"Stelle",null,"Bemerkungen ",null,null,null,"Name",null,"Stelle",null,"Bemerkungen ",null,null,null,"Name",null,"Stelle",null,"Bemerkungen ",null,null,null,"Name",null,"Stelle",null,"Bemerkungen ",null,null,null,"Name",null,"Stelle",null,"Bemerkungen ",null,null,null,"Name",null,"Stelle",null,"Bemerkungen ",null,null,null,"Name",null,"Stelle",null,"Bemerkungen ",null,null,null,"Name",null,"Stelle",null,"Bemerkungen ",null,null,null,"Name",null,"Stelle",null,"Bemerkungen ",null,null,null,"Name",null,"Stelle",null,"Bemerkungen ",null,null,null,"Name",null,"Stelle",null,"Bemerkungen ",null,null,null,"Name",null,"Stelle",null,"Bemerkungen ",null,null,null,"Name",null,"Stelle",null,"Bemerkungen ",null,null,null,"Name",null,"Stelle",null,"Bemerkungen ",null,null,null,"Name",null,"Stelle",null,"Bemerkungen ",null,null,null,"Name",null,"Stelle",null,"Bemerkungen ",null,null,null,"Name",null,"Stelle",null,"Bemerkungen ",null,null,null,"Name",null,"Stelle",null,"Bemerkungen ",null,null,null,"Name",null,"Stelle",null,"Bemerkungen ",null,null,null,"Name",null,"Stelle",null,"Bemerkungen ",null,null,null,"Name",null,"Stelle",null,"Bemerkungen ",null,null,null,"Name",null,"Stelle",null,"Bemerkungen ",null,null,null,"Name",null,"Stelle",null,"Bemerkungen ",null,null,null,"Name",null,"Stelle",null,"Bemerkungen ",null,null,null,"Name",null,"Stelle",null,"Bemerkungen ",null,null,null,"Name",null,"Stelle",null,"Bemerkungen ",null,null,null,"Name",null,"Stelle",null,"Bemerkungen ",null,null,null,"Name",null,"Stelle",null,"Bemerkungen ",null,null,null,"Name",null,"Stelle",null,"Bemerkungen ",null,null,null,"Name",null,"Stelle",null,"Bemerkungen ",null,null,null,"Name",null,"Stelle",null,"Bemerkungen ",null,null,null,"Name",null,"Stelle",null,"Bemerkungen ",null,null,null,"Name",null,"Stelle",null,"Bemerkungen ",null,null,null,"Name",null,"Stelle",null,"Bemerkungen ",null,null,null,"Name",null,"Stelle",null,"Bemerkungen ",null,null,null,"Name",null,"Stelle",null,"Bemerkungen ",null,null,null,"Name",null,"Stelle",null,"Bemerkungen ",null,null,null,"Name",null,"Stelle",null,"Bemerkungen ",null,null,null,"Name",null,"Stelle",null,"Bemerkungen ",null,null,null,"Name",null,"Stelle",null,"Bemerkungen ",null,null,null,"Name",null,"Stelle",null,"Bemerkungen ",null,null,null,"Name",null,"Stelle",null,"Bemerkungen ",null,null,null,"Name",null,"Stelle",null,"Bemerkungen ",null,null,null,"Name",null,"Stelle",null,"Bemerkungen ",null,null,null,"Name",null,"Stelle",null,"Bemerkungen ",null,null,null,"Name",null,"Stelle",null,"Bemerkungen ",null,null,null,"Name",null,"Stelle",null,"Bemerkungen ",null,null,null,"Name",null,"Stelle",null,"Bemerkungen ",null,null,null,"Name",null,"Stelle",null,"Bemerkungen ",null,null,null,"Name",null,"Stelle",null,"Bemerkungen ",null,null,null,"Name",null,"Stelle",null,"Bemerkungen ",null,null,null,"Name",null,"Stelle",null,"Bemerkungen ",null,null,null,"Name",null,"Stelle",null,"Bemerkungen ",null,null,null,"Name",null,"Stelle",null,"Bemerkungen ",null,null,null,"Name",null,"Stelle",null,"Bemerkungen ",null,null,null,"Name",null,"Stelle",null,"Bemerkungen ",null,null,null,"Name",null,"Stelle",null,"Bemerkungen ",null,null,null,"Name",null,"Stelle",null,"Bemerkungen ",null,null,null,"Name",null,"Stelle",null,"Bemerkungen ",null,null,null,"Name",null,"Stelle",null,"Bemerkungen ",null,null,null,"Name",null,"Stelle",null,"Bemerkungen ",null,null,null,"Name",null,"Stelle",null,"Bemerkungen ",null,null,null,"Name",null,"Stelle",null,"Bemerkungen ",null,null,null,"Name",null,"Stelle",null,"Bemerkungen ",null,null,null,"Name",null,"Stelle",null,"Bemerkungen ",null,null,null,"Name",null,"Stelle",null,"Bemerkungen ",null,null,null,"Name",null,"Stelle",null,"Bemerkungen ",null,null,null,"Name",null,"Stelle",null,"Bemerkungen ",null,null,null,"Name",null,"Stelle",null,"Bemerkungen ",null,null,null,"Name",null,"Stelle",null,"Bemerkungen ",null,null,null,"Name",null,"Stelle",null,"Bemerkungen ",null,null,null,"Name",null,"Stelle",null,"Bemerkungen ",null,null,null,"Name",null,"Stelle",null,"Bemerkungen ",null,null,null,"Name",null,"Stelle",null,"Bemerkungen ",null,null,null,"Name",null,"Stelle",null,"Bemerkungen ",null,null,null,"Name",null,"Stelle",null,"Bemerkungen ",null,null,null,"Name",null,"Stelle",null,"Bemerkungen ",null,null,null,"Name",null,"Stelle",null,"Bemerkungen ",null,null,null,"Name",null,"Stelle",null,"Bemerkungen ",null,null,null,"Name",null,"Stelle",null,"Bemerkungen ",null,null,null,"Name",null,"Stelle",null,"Bemerkungen ",null,null,null,"Name",null,"Stelle",null,"Bemerkungen ",null,null,null,"Name",null,"Stelle",null,"Bemerkungen ",null,null,null,"Name",null,"Stelle",null,"Bemerkungen ",null,null,null,"Name",null,"Stelle",null,"Bemerkungen ",null,null,null,"Name",null,"Stelle",null,"Bemerkungen ",null,null,null,"Name",null,"Stelle",null,"Bemerkungen ",null,null,null,"Name",null,"Stelle",null,"Bemerkungen ",null,null,null,"Name",null,"Stelle",null,"Bemerkungen ",null,null,null,"Name",null,"Stelle",null,"Bemerkungen ",null,null,null,"Name",null,"Stelle",null,"Bemerkungen ",null,null,null,"Name",null,"Stelle",null,"Bemerkungen ",null,null,null,"Name",null,"Stelle",null,"Bemerkungen ",null,null,null,"Name",null,"Stelle",null,"Bemerkungen ",null,null,null,"Name",null,"Stelle",null,"Bemerkungen ",null,null,null,"Name",null,"Stelle",null,"Bemerkungen ",null,null,null,"Name",null,"Stelle",null,"Bemerkungen ",null,null,null,"Name",null,"Stelle",null,"Bemerkungen ",null,null,null,"Name",null,"Stelle",null,"Bemerkungen ",null,null,null,"Name",null,"Stelle",null,"Bemerkungen ",null,null,null,"Name",null,"Stelle",null,"Bemerkungen ",null,null,null,"Name",null,"Stelle",null,"Bemerkungen ",null,null,null,"Name",null,"Stelle",null,"Bemerkungen ",null,null,null,"Name",null,"Stelle",null,"Bemerkungen ",null,null,null,"Name",null,"Stelle",null,"Bemerkungen ",null,null,null,"Name",null,"Stelle",null,"Bemerkungen ",null,null,null,"Name",null,"Stelle",null,"Bemerkungen ",null,null,null,"Name",null,"Stelle",null,"Bemerkungen ",null,null,null,"Name",null,"Stelle",null,"Bemerkungen ",null,null,null,"Name",null,"Stelle",null,"Bemerkungen ",null,null,null,"Name",null,"Stelle",null,"Bemerkungen ",null,null,null,"Name",null,"Stelle",null,"Bemerkungen ",null,null,null,"Name",null,"Stelle",null,"Bemerkungen ",null,null,null,"Name",null,"Stelle",null,"Bemerkungen ",null,null,null,"Name",null,"Stelle",null,"Bemerkungen ",null,null,null,"Name",null,"Stelle",null,"Bemerkungen ",null,null,null,"Name",null,"Stelle",null,"Bemerkungen ",null,null,null,"Name",null,"Stelle",null,"Bemerkungen ",null,null,null,"Name",null,"Stelle",null,"Bemerkungen ",null,null,null,"Name",null,"Stelle",null,"Bemerkungen ",null,null,null,"Name",null,"Stelle",null,"Bemerkungen ",null,null,null,"Name",null,"Stelle",null,"Bemerkungen ",null,null,null,"Name",null,"Stelle",null,"Bemerkungen ",null,null,null,"Name",null,"Stelle",null,"Bemerkungen ",null,null,null,"Name",null,"Stelle",null,"Bemerkungen ",null,null,null,"Name",null,"Stelle",null,"Bemerkungen ",null,null,null,"Name",null,"Stelle",null,"Bemerkungen ",null,null,null,"Name",null,"Stelle",null,"Bemerkungen ",null,null,null,"Name",null,"Stelle",null,"Bemerkungen ",null,null,null,"Name",null,"Stelle",null,"Bemerkungen ",null,null,null,"Name",null,"Stelle",null,"Bemerkungen ",null,null,null,"Name",null,"Stelle",null,"Bemerkungen ",null,null,null,"Name",null,"Stelle",null,"Bemerkungen ",null,null,null,"Name",null,"Stelle",null,"Bemerkungen ",null,null,null,"Name",null,"Stelle",null,"Bemerkungen ",null,null,null,"Name",null,"Stelle",null,"Bemerkungen ",null,null,null,"Name",null,"Stelle",null,"Bemerkungen ",null,null,null,"Name",null,"Stelle",null,"Bemerkungen ",null,null,null,"Name",null,"Stelle",null,"Bemerkungen ",null,null,null,"Name",null,"Stelle",null,"Bemerkungen ",null,null,null,"Name",null,"Stelle",null,"Bemerkungen ",null,null,null,"Name",null,"Stelle",null,"Bemerkungen ",null,null,null,"Name",null,"Stelle",null,"Bemerkungen ",null,null,null,"Name",null,"Stelle",null,"Bemerkungen ",null,null,null,"Name",null,"Stelle",null,"Bemerkungen ",null,null,null,"Name",null,"Stelle",null,"Bemerkungen ",null,null,null,"Name",null,"Stelle",null,"Bemerkungen ",null,null,null,"Name",null,"Stelle",null,"Bemerkungen ",null,null,null,"Name",null,"Stelle",null,"Bemerkungen ",null,null,null,"Name",null,"Stelle",null,"Bemerkungen ",null,null,null,"Name",null,"Stelle",null,"Bemerkungen ",null,null,null,"Name",null,"Stelle",null,"Bemerkungen ",null,null,null,"Name",null,"Stelle",null,"Bemerkungen ",null,null,null,"Name",null,"Stelle",null,"Bemerkungen ",null,null,null,"Name",null,"Stelle",null,"Bemerkungen ",null,null,null,"Name",null,"Stelle",null,"Bemerkungen ",null,null,null,"Name",null,"Stelle",null,"Bemerkungen ",null,null,null,"Name",null,"Stelle",null,"Bemerkungen ",null,null,null,"Name",null,"Stelle",null,"Bemerkungen ",null,null,null,"Name",null,"Stelle",null,"Bemerkungen ",null,null,null,"Name",null,"Stelle",null,"Bemerkungen ",null,null,null,"Name",null,"Stelle",null,"Bemerkungen ",null,null,null,"Name",null,"Stelle",null,"Bemerkungen ",null,null,null,"Name",null,"Stelle",null,"Bemerkungen ",null,null,null,"Name",null,"Stelle",null,"Bemerkungen ",null,null,null,"Name",null,"Stelle",null,"Bemerkungen ",null,null,null,"Name",null,"Stelle",null,"Bemerkungen ",null,null,null,"Name",null,"Stelle",null,"Bemerkungen ",null,null,null,"Name",null,"Stelle",null,"Bemerkungen ",null,null,null,"Name",null,"Stelle",null,"Bemerkungen ",null,null,null,"Name",null,"Stelle",null,"Bemerkungen ",null,null,null,"Name",null,"Stelle",null,"Bemerkungen ",null,null,null,"Name",null,"Stelle",null,"Bemerkungen ",null,null,null,"Name",null,"Stelle",null,"Bemerkungen ",null,null,null,"Name",null,"Stelle",null,"Bemerkungen ",null,null,null,"Name",null,"Stelle",null,"Bemerkungen ",null,null,null,"Name",null,"Stelle",null,"Bemerkungen ",null,null,null,"Name",null,"Stelle",null,"Bemerkungen ",null,null,null,"Name",null,"Stelle",null,"Bemerkungen ",null,null,null,"Name",null,"Stelle",null,"Bemerkungen ",null,null,null,"Name",null,"Stelle",null,"Bemerkungen ",null,null,null,"Name",null,"Stelle",null,"Bemerkungen ",null,null,null,"Name",null,"Stelle",null,"Bemerkungen ",null,null,null,"Name",null,"Stelle",null,"Bemerkungen ",null,null,null,"Name",null,"Stelle",null,"Bemerkungen ",null,null,null,"Name",null,"Stelle",null,"Bemerkungen ",null,null,null,"Name",null,"Stelle",null,"Bemerkungen ",null,null,null,"Name",null,"Stelle",null,"Bemerkungen ",null,null,null,"Name",null,"Stelle",null,"Bemerkungen ",null,null,null,"Name",null,"Stelle",null,"Bemerkungen ",null,null,null,"Name",null,"Stelle",null,"Bemerkungen ",null,null,null,"Name",null,"Stelle",null,"Bemerkungen ",null,null,null,"Name",null,"Stelle",null,"Bemerkungen ",null,null,null,"Name",null,"Stelle",null,"Bemerkungen ",null,null,null,"Name",null,"Stelle",null,"Bemerkungen ",null,null,null,"Name",null,"Stelle",null,"Bemerkungen ",null,null,null,"Name",null,"Stelle",null,"Bemerkungen ",null,null,null,"Name",null,"Stelle",null,"Bemerkungen ",null,null,null,"Name",null,"Stelle",null,"Bemerkungen ",null,null,null,"Name",null,"Stelle",null,"Bemerkungen ",null,null,null,"Name",null,"Stelle",null,"Bemerkungen ",null,null,null,"Name",null,"Stelle",null,"Bemerkungen ",null,null,null,"Name",null,"Stelle",null,"Bemerkungen ",null,null,null,"Name",null,"Stelle",null,"Bemerkungen ",null,null,null,"Name",null,"Stelle",null,"Bemerkungen ",null,null,null,"Name",null,"Stelle",null,"Bemerkungen ",null,null,null,"Name",null,"Stelle",null,"Bemerkungen ",null,null,null,"Name",null,"Stelle",null,"Bemerkungen ",null,null,null,"Name",null,"Stelle",null,"Bemerkungen ",null,null,null,"Name",null,"Stelle",null,"Bemerkungen ",null,null,null,"Name",null,"Stelle",null,"Bemerkungen ",null,null,null,"Name",null,"Stelle",null,"Bemerkungen ",null,null,null,"Name",null,"Stelle",null,"Bemerkungen ",null,null,null,"Name",null,"Stelle",null,"Bemerkungen ",null,null,null,"Name",null,"Stelle",null,"Bemerkungen ",null,null,null,"Name",null,"Stelle",null,"Bemerkungen ",null,null,null,"Name",null,"Stelle",null,"Bemerkungen ",null,null,null,"Name",null,"Stelle",null,"Bemerkungen ",null,null,null,"Name",null,"Stelle",null,"Bemerkungen ",null,null,null,"Name",null,"Stelle",null,"Bemerkungen ",null,null,null,"Name",null,"Stelle",null,"Bemerkungen ",null,null,null,"Name",null,"Stelle",null,"Bemerkungen ",null,null,null,"Name",null,"Stelle",null,"Bemerkungen ",null,null,null,"Name",null,"Stelle",null,"Bemerkungen ",null,null,null,"Name",null,"Stelle",null,"Bemerkungen ",null,null,null,"Name",null,"Stelle",null,"Bemerkungen ",null,null,null,"Name",null,"Stelle",null,"Bemerkungen ",null,null,null,"Name",null,"Stelle",null,"Bemerkungen ",null,null,null,"Name",null,"Stelle",null,"Bemerkungen ",null,null,null,"Name",null,"Stelle",null,"Bemerkungen "]
[]
[]
[]
[]
[]
[]
[]
[]
[]
[]
[]
[]
[]
[]
[]
[]
[]
[null,null," 3. Dokumentenübersicht "]
[null,null," Über welche relevanten Dokumente verfügen wir bereits in Bezug auf die Alkoholpolitik? "]
[]
[null,"Legislaturziele"]
[]
[null,"Verfassungs- oder Gesetzesartikel"]
[]
[null,"Andere strategische Unterlagen",null,"z.B. KAP, spezifische Arbeitskonzepte, Projektdokumentation, Bedarfsanalysen usw. "]
[]
[null,"Relevante Datenquellen",null,"z.B. spezifisch auf den Kanton ausgewertete Daten; Spitalstatistiken, usw. "]
[]
[null,"Relevante Evaluationen"]
[]
[null,"Kommunikationsunterlagen",null,"z.B. Öffentlichkeitsarbeit, Richtlinien, Haltungen, Argumentarium "]

{"sheet":"2 Stärken-Schwächen-Analyse","index":1,"n_rows":197,"n_cols":20,"rows_kept":197,"cut":false,"hidden":false,"merged":[[8,1,8,11],[9,1,9,10],[23,1,25,1],[40,1,42,1],[69,1,71,1],[55,1,57,1],[65,1,66,1],[62,1,64,1],[179,1,181,1],[195,1,197,1],[85,1,87,1],[105,1,107,1],[120,1,122,1],[135,1,137,1],[151,1,153,1],[81,1,82,1],[92,1,94,1],[164,1,166,1],[78,1,80,1],[113,1,115,1]]}
[null,null,null,null,"Ja",null,"Sehr gut",null,null,"Mit hoher Priorität"]
[null,null,null,null,"Nein",null,"Eher gut",null,null,"Mit mittlerer Priorität"]
[null,null,null,null,"Teilweise ",null,"Ausreichend",null,null,"Mit geringer Priorität"]
[null,null,null,null,"In Planung",null,"Eher schlecht"]
[null,null,null,null,"In Entwicklung",null,"Sehr schlecht"]
[null,null,null,null,"Weiss nicht",null,"Irrelevant"]
[]
[]
[null,"Stärken-Schwächen-Analyse"]
[null,"Identifizierung der Stärken und Schwächen im Kanton "]
[]
[null,null,null,"Handlungsfeld 1: Führungsstärke und Entschlossenheit"]
[null,"Arbeiten zugunsten eines politischen Auftrags",null,null,"1. Bestandes-\naufnahme\nHaben/machen wir bereits etwas?",null,"2. Beurteilung  \nIst-Zustand\nWie beurteilen wir den Ist-Zustand?",null,null,"3. Priorisierung\nMit welcher Priorität möchten wir uns verbessern?",null,null,"4. Begründung \nBitte begründen Sie Ihre Einschätzungen.\n\n"]
[null,null,null,null,null,null,"IST-Zustand","Wert IST","a","SOLL-Zustand","Wert Priorität","b","c","d","e","Ist+Prioriät","Erfolgsfaktor","Handlungsfelder","HF-Zahl","Handlungsschwerpunkte"]
[]
[null,"Existiert ein stabiles Netzwerk von Interessengruppen, die die Anliegen der Alkoholpolitik vertreten? ",null,null,null,null,null,{"$f":"IF(G16=$G$6,\"Irrelevant\",IF(G16=$G$5,1,IF(G16=$G$4,2,IF(G16=$G$3,3,IF(G16=$G$2,4,IF(G16=$G$1,5,\"\"))))))","v":""},null,null,{"$f":"IF(J16=$J$1,2,IF(J16=$J$2,1,IF(J16=$J$3,0,\"\")))","v":""},null,null,null,null,{"$f":"IF(H16=\"\",\"\",IF(K16=\"\",\"\",IF(H16+K16>=5,5,H16+K16)))","v":""},"Netzwerk von Interessengruppen für Anliegen der Alkoholpolitik (Führungsstärke und Entschlossenheit)","Handlungsfeld 1",1,"Arbeiten zugunsten eines politischen Auftrags"]
[null,null,null,null,null,null,null,null,null,null,null,null,null,null,null,{"$f":"IF(H17=\"\",\"\",IF(K17=\"\",\"\",IF(H17+K17>=5,5,H17+K17)))","v":""}]
[null,"Gibt es Vorarbeiten zugunsten eines politischen Auftrags?",null,null,null,null,null,{"$f":"IF(G18=$G$6,\"Irrelevant\",IF(G18=$G$5,1,IF(G18=$G$4,2,IF(G18=$G$3,3,IF(G18=$G$2,4,IF(G18=$G$1,5,\"\"))))))","v":""},null,null,{"$f":"IF(J18=$J$1,2,IF(J18=$J$2,1,IF(J18=$J$3,0,\"\")))","v":""},null,null,null,null,"","Vorarbeiten zugunsten eines politischen Auftrags (Führungsstärke und Entschlossenheit)","Handlungsfeld 1",1,"Arbeiten zugunsten eines politischen Auftrags"]
[null,null,null,null,null,null,null,null,null,null,null,null,null,null,null,""]
[null,"Werden Chancen genutzt, die sich in der Politik bieten?",null,null,null,null,null,{"$f":"IF(G20=$G$6,\"Irrelevant\",IF(G20=$G$5,1,IF(G20=$G$4,2,IF(G20=$G$3,3,IF(G20=$G$2,4,IF(G20=$G$1,5,\"\"))))))","v":""},null,null,{"$f":"IF(J20=$J$1,2,IF(J20=$J$2,1,IF(J20=$J$3,0,\"\")))","v":""},null,null,null,null,"","Nutzung von Chancen in der Politik (Führungsstärke und Entschlossenheit)","Handlungsfeld 1",1,"Arbeiten zugunsten eines politischen Auftrags"]
[null,null,null,null,null,null,null,null,null,null,null,null,null,null,null,{"$f":"IF(H21=\"\",\"\",IF(K21=\"\",\"\",IF(H21+K21>=5,5,H21+K21)))","v":""}]
[null,"Weiterer Faktor zu diesem Schwerpunkt? \nBitte hier eintragen",null,null,null,null,null,{"$f":"IF(G22=$G$6,\"Irrelevant\",IF(G22=$G$5,1,IF(G22=$G$4,2,IF(G22=$G$3,3,IF(G22=$G$2,4,IF(G22=$G$1,5,\"\"))))))","v":""},null,null,{"$f":"IF(J22=$J$1,2,IF(J22=$J$2,1,IF(J22=$J$3,0,\"\")))","v":""},null,null,null,null,"",{"$f":"B22","v":"Weiterer Faktor zu diesem Schwerpunkt? \nBitte hier eintragen"},"Handlungsfeld 1",1,"Arbeiten zugunsten eines politischen Auftrags"]
[]
[null,"Gesamtbeurteilung: Wie beurteilen wir unseren Kanton insgesamt in Bezug auf die Arbeiten zugunsten eines politischen Auftrags? ",null,null,null,null,null,null,null,null,null,null,null,null,null,""]
[null,null,null,null,null,null,null,{"$f":"IF(G25=$G$6,\"Irrelevant\",IF(G25=$G$5,1,IF(G25=$G$4,2,IF(G25=$G$3,3,IF(G25=$G$2,4,IF(G25=$G$1,5,\"\"))))))","v":""},null,null,{"$f":"IF(J25=$J$1,2,IF(J25=$J$2,1,IF(J25=$J$3,0,\"\")))","v":""},null,null,null,null,""]
[null,null,null,null,null,null,null,null,null,null,null,null,null,null,null,""]
[null,null,null,null,null,null,null,null,null,null,null,null,null,null,null,""]
[null,null,null,null,null,null,null,null,null,null,null,null,null,null,null,""]
[null,"Erarbeitung von strategischen Grundlagen und Evaluation der Aktivitäten",null,null,"1. Bestandes-\naufnahme\nHaben/machen wir bereits etwas?",null,"2. Beurteilung  \nIst-Zustand\nWie beurteilen wir den Ist-Zustand?",null,null,"3. Priorisierung\nMit welcher Priorität möchten wir uns verbessern?",null,null,"4. Begründung \nBitte begründen Sie Ihre Einschätzungen.\n\n",null,null,""]
[null,null,null,null,null,null,null,null,null,null,null,null,null,null,null,""]
[null,"Sind strategische Grundlagen für die Alkoholpolitik vorhanden?",null,null,null,null,null,{"$f":"IF(G31=$G$6,\"Irrelevant\",IF(G31=$G$5,1,IF(G31=$G$4,2,IF(G31=$G$3,3,IF(G31=$G$2,4,IF(G31=$G$1,5,\"\"))))))","v":""},null,null,{"$f":"IF(J31=$J$1,2,IF(J31=$J$2,1,IF(J31=$J$3,0,\"\")))","v":""},null,null,null,null,"","Strategische Grundlagen (Führungsstärke und Entschlossenheit)","Handlungsfeld 1",1,"Erarbeitung von strategischen Grundlagen und Evaluation der Aktivitäten"]
[null,null,null,null,null,null,null,null,null,null,null,null,null,null,null,""]
[null,"Sind Daten zur Beurteilung des Handlungsbedarfs vorhanden?",null,null,null,null,null,{"$f":"IF(G33=$G$6,\"Irrelevant\",IF(G33=$G$5,1,IF(G33=$G$4,2,IF(G33=$G$3,3,IF(G33=$G$2,4,IF(G33=$G$1,5,\"\"))))))","v":""},null,null,{"$f":"IF(J33=$J$1,2,IF(J33=$J$2,1,IF(J33=$J$3,0,\"\")))","v":""},null,null,null,null,"","Daten zur Beurteilung des Handlungsbedarfs (Führungsstärke und Entschlossenheit)","Handlungsfeld 1",1,"Erarbeitung von strategischen Grundlagen und Evaluation der Aktivitäten"]
[null,null,null,null,null,null,null,null,null,null,null,null,null,null,null,""]
[null,"Werden relevante Akteure in die Strategieerarbeitung oder in laufende Projekte einbezogen?",null,null,null,null,null,{"$f":"IF(G35=$G$6,\"Irrelevant\",IF(G35=$G$5,1,IF(G35=$G$4,2,IF(G35=$G$3,3,IF(G35=$G$2,4,IF(G35=$G$1,5,\"\"))))))","v":""},null,null,{"$f":"IF(J35=$J$1,2,IF(J35=$J$2,1,IF(J35=$J$3,0,\"\")))","v":""},null,null,null,null,"","Einbezug relevanter Akteure (Führungsstärke und Entschlossenheit)","Handlungsfeld 1",1,"Erarbeitung von strategischen Grundlagen und Evaluation der Aktivitäten"]
[null,null,null,null,null,null,null,null,null,null,null,null,null,null,null,""]
[null,"Wurden die bisherigen Tätigkeiten evaluiert?",null,null,null,null,null,{"$f":"IF(G37=$G$6,\"Irrelevant\",IF(G37=$G$5,1,IF(G37=$G$4,2,IF(G37=$G$3,3,IF(G37=$G$2,4,IF(G37=$G$1,5,\"\"))))))","v":""},null,null,{"$f":"IF(J37=$J$1,2,IF(J37=$J$2,1,IF(J37=$J$3,0,\"\")))","v":""},null,null,null,null,"","Evaluation bisheriger Tätigkeiten (Führungsstärke und Entschlossenheit)","Handlungsfeld 1",1,"Erarbeitung von strategischen Grundlagen und Evaluation der Aktivitäten"]
[null,null,null,null,null,null,null,null,null,null,null,null,null,null,null,""]
[null,"Weiterer Faktor zu diesem Schwerpunkt? \nBitte hier eintragen",null,null,null,null,null,{"$f":"IF(G39=$G$6,\"Irrelevant\",IF(G39=$G$5,1,IF(G39=$G$4,2,IF(G39=$G$3,3,IF(G39=$G$2,4,IF(G39=$G$1,5,\"\"))))))","v":""},null,null,{"$f":"IF(J39=$J$1,2,IF(J39=$J$2,1,IF(J39=$J$3,0,\"\")))","v":""},null,null,null,null,"",{"$f":"B39","v":"Weiterer Faktor zu diesem Schwerpunkt? \nBitte hier eintragen"},"Handlungsfeld 1",1,"Erarbeitung von strategischen Grundlagen und Evaluation der Aktivitäten"]
[]
[null,"Gesamtbeurteilung: Wie beurteilen wir unseren Kanton insgesamt in Bezug auf die Erarbeitung von strategischen Grundlagen und die Evaluation der Aktivitäten? ",null,null,null,null,null,null,null,null,null,null,null,null,null,""]
[null,null,null,null,null,null,null,{"$f":"IF(G42=$G$6,\"Irrelevant\",IF(G42=$G$5,1,IF(G42=$G$4,2,IF(G42=$G$3,3,IF(G42=$G$2,4,IF(G42=$G$1,5,\"\"))))))","v":""},null,null,{"$f":"IF(J42=$J$1,2,IF(J42=$J$2,1,IF(J42=$J$3,0,\"\")))","v":""},null,null,null,null,""]
[null,null,null,null,null,null,null,null,null,null,null,null,null,null,null,""]
[null,null,null,null,null,null,null,null,null,null,null,null,null,null,null,""]
[null,null,null,null,null,null,null,null,null,null,null,null,null,null,null,""]
[null,"Koordination der Aktivitäten der relevanten Akteure/-innen",null,null,"1. Bestandes-\naufnahme\nHaben/machen wir bereits etwas?",null,"2. Beurteilung  \nIst-Zustand\nWie beurteilen wir den Ist-Zustand?",null,null,"3. Priorisierung\nMit welcher Priorität möchten wir uns verbessern?",null,null,"4. Begründung \nBitte begründen Sie Ihre Einschätzungen.\n\n",null,null,""]
[null,null,null,null,null,null,null,null,null,null,null,null,null,null,null,""]
[null,"Gibt es eine Zusammenarbeit zwischen den verwaltungsinternen Stellen? ",null,null,null,null,null,{"$f":"IF(G48=$G$6,\"Irrelevant\",IF(G48=$G$5,1,IF(G48=$G$4,2,IF(G48=$G$3,3,IF(G48=$G$2,4,IF(G48=$G$1,5,\"\"))))))","v":""},null,null,{"$f":"IF(J48=$J$1,2,IF(J48=$J$2,1,IF(J48=$J$3,0,\"\")))","v":""},null,null,null,null,"","Verwaltungsinterne Zusammenarbeit (Führungsstärke und Entschlossenheit)","Handlungsfeld 1",1,"Koordination der Aktivitäten der relevanten Akteure/-innen"]
[null,null,null,null,null,null,null,null,null,null,null,null,null,null,null,""]
[null,"Gibt es eine Zusammenarbeit zwischen dem Kanton und den Gemeinden?",null,null,null,null,null,{"$f":"IF(G50=$G$6,\"Irrelevant\",IF(G50=$G$5,1,IF(G50=$G$4,2,IF(G50=$G$3,3,IF(G50=$G$2,4,IF(G50=$G$1,5,\"\"))))))","v":""},null,null,{"$f":"IF(J50=$J$1,2,IF(J50=$J$2,1,IF(J50=$J$3,0,\"\")))","v":""},null,null,null,null,"","Zusammenarbeit zwischen Kanton und Gemeinden (Führungsstärke und Entschlossenheit)","Handlungsfeld 1",1,"Koordination der Aktivitäten der relevanten Akteure/-innen"]
[null,null,null,null,null,null,null,null,null,null,null,null,null,null,null,""]
[null,"Gibt es eine Zusammenarbeit zwischen der Verwaltung und anderen Ansprechpartnern ausserhalb der Verwaltung?",null,null,null,null,null,{"$f":"IF(G52=$G$6,\"Irrelevant\",IF(G52=$G$5,1,IF(G52=$G$4,2,IF(G52=$G$3,3,IF(G52=$G$2,4,IF(G52=$G$1,5,\"\"))))))","v":""},null,null,{"$f":"IF(J52=$J$1,2,IF(J52=$J$2,1,IF(J52=$J$3,0,\"\")))","v":""},null,null,null,null,"","Zusammenarbeit zwischen Verwaltung und anderen Ansprechpartnern (Führungsstärke und Entschlossenheit)","Handlungsfeld 1",1,"Koordination der Aktivitäten der relevanten Akteure/-innen"]
[null,null,null,null,null,null,null,null,null,null,null,null,null,null,null,""]
[null,"Weiterer Faktor zu diesem Schwerpunkt? \nBitte hier eintragen",null,null,null,null,null,{"$f":"IF(G54=$G$6,\"Irrelevant\",IF(G54=$G$5,1,IF(G54=$G$4,2,IF(G54=$G$3,3,IF(G54=$G$2,4,IF(G54=$G$1,5,\"\"))))))","v":""},null,null,{"$f":"IF(J54=$J$1,2,IF(J54=$J$2,1,IF(J54=$J$3,0,\"\")))","v":""},null,null,null,null,"",{"$f":"B54","v":"Weiterer Faktor zu diesem Schwerpunkt? \nBitte hier eintragen"},"Handlungsfeld 1",1,"Koordination der Aktivitäten der relevanten Akteure/-innen"]
[]
[null,"Gesamtbeurteilung: Wie beurteilen wir unseren Kanton insgesamt in Bezug auf die Koordination der Aktivitäten der relevanten Akteure/-innen? ",null,null,null,null,null,null,null,null,null,null,null,null,null,""]
[null,null,null,null,null,null,null,{"$f":"IF(G57=$G$6,\"Irrelevant\",IF(G57=$G$5,1,IF(G57=$G$4,2,IF(G57=$G$3,3,IF(G57=$G$2,4,IF(G57=$G$1,5,\"\"))))))","v":""},null,null,{"$f":"IF(J57=$J$1,2,IF(J57=$J$2,1,IF(J57=$J$3,0,\"\")))","v":""},null,null,null,null,""]
[null,null,null,null,null,null,null,null,null,null,null,null,null,null,null,""]
[null,null,null,null,null,null,null,null,null,null,null,null,null,null,null,""]
[null,null,null,null,null,null,null,null,null,null,null,null,null,null,null,""]
[null,null,null,"Handlungsfeld 2: Gesundheitsschutz und Früherkennung",null,null,null,null,null,null,null,null,null,null,null,""]
[null,"Früherkennung und Frühintervention \nin verschiedenen gesellschaftlichen Kontexten",null,null,"1. Bestandes-\naufnahme\nHaben/machen wir bereits etwas?",null,"2. Beurteilung  \nIst-Zustand\nWie beurteilen wir den Ist-Zustand?",null,null,"3. Priorisierung\nMit welcher Priorität möchten wir uns verbessern?",null,null,"4. Begründung \nBitte begründen Sie Ihre Einschätzungen.\n\n",null,null,""]
[null,"Werden Massnahmen zur Früherkennung und Frühintervention bei verschiedenen Zielgruppen (Kindern/Jugendlichen, Erwachsenen, älteren Personen, Migranten/-innen usw.) umgesetzt?",null,null,null,null,null,null,null,null,null,null,null,null,null,""]
[null,null,null,null,null,null,null,{"$f":"IF(G64=$G$6,\"Irrelevant\",IF(G64=$G$5,1,IF(G64=$G$4,2,IF(G64=$G$3,3,IF(G64=$G$2,4,IF(G64=$G$1,5,\"\"))))))","v":""},null,null,{"$f":"IF(J64=$J$1,2,IF(J64=$J$2,1,IF(J64=$J$3,0,\"\")))","v":""},null,null,null,null,"","Massnahmen zur Früherkennung und Frühintervention (Gesundheitsschutz und Früherkennung)","Handlungsfeld 2",2,"Früherkennung und Frühintervention in verschiedenen gesellschaftlichen Kontexten"]
[null,null,null,null,null,null,null,null,null,null,null,null,null,null,null,""]
[null,"Werden Massnahmen zur Sensibilisierung und Befähigung von Multiplikatoren/-innen zur Früherkennung und Frühintervention umgesetzt?",null,null,null,null,null,{"$f":"IF(G66=$G$6,\"Irrelevant\",IF(G66=$G$5,1,IF(G66=$G$4,2,IF(G66=$G$3,3,IF(G66=$G$2,4,IF(G66=$G$1,5,\"\"))))))","v":""},null,null,{"$f":"IF(J66=$J$1,2,IF(J66=$J$2,1,IF(J66=$J$3,0,\"\")))","v":""},null,null,null,null,"","Massnahmen zur Sensibilisierung und Befähigung von Multiplikatoren/-innen (Gesundheitsschutz und Früherkennung)","Handlungsfeld 2",2,"Früherkennung und Frühintervention in verschiedenen gesellschaftlichen Kontexten"]
[null,null,null,null,null,null,null,null,null,null,null,null,null,null,null,""]
[null,"Weiterer Faktor zu diesem Schwerpunkt? \nBitte hier eintragen",null,null,null,null,null,{"$f":"IF(G68=$G$6,\"Irrelevant\",IF(G68=$G$5,1,IF(G68=$G$4,2,IF(G68=$G$3,3,IF(G68=$G$2,4,IF(G68=$G$1,5,\"\"))))))","v":""},null,null,{"$f":"IF(J68=$J$1,2,IF(J68=$J$2,1,IF(J68=$J$3,0,\"\")))","v":""},null,null,null,null,"",{"$f":"B68","v":"Weiterer Faktor zu diesem Schwerpunkt? \nBitte hier eintragen"},"Handlungsfeld 2",2,"Früherkennung und Frühintervention in verschiedenen gesellschaftlichen Kontexten"]
[]
[null,"Gesamtbeurteilung: Wie beurteilen wir unseren Kanton insgesamt in Bezug auf die Früherkennung und Frühintervention in verschiedenen gesellschaftlichen Kontexten?",null,null,null,null,null,null,null,null,null,null,null,null,null,""]
[null,null,null,null,null,null,null,{"$f":"IF(G71=$G$6,\"Irrelevant\",IF(G71=$G$5,1,IF(G71=$G$4,2,IF(G71=$G$3,3,IF(G71=$G$2,4,IF(G71=$G$1,5,\"\"))))))","v":""},null,null,{"$f":"IF(J71=$J$1,2,IF(J71=$J$2,1,IF(J71=$J$3,0,\"\")))","v":""},null,null,null,null,""]
[null,null,null,null,null,null,null,null,null,null,null,null,null,null,null,""]
[null,null,null,null,null,null,null,{"$f":"IF(G73=\"Sehr schlecht\",-2,IF(G73=\"Eher schlecht\",-1,IF(G73=\"Ausreichend\",0,IF(G73=\"Eher gut\",1,IF(G73=\"Sehr gut\",2,\"\")))))","v":""},null,null,null,null,null,null,null,""]
[null,null,null,null,null,null,null,null,null,null,null,null,null,null,null,""]
[null,null,null,"Handlungsfeld 3: Behandlung und soziale Integration",null,null,null,null,null,null,null,null,null,null,null,""]
[null,"Bereitstellung von spezifischen Behandlungs- und Beratungsangeboten",null,null,"1. Bestandes-\naufnahme\nHaben/machen wir bereits etwas?",null,"2. Beurteilung  \nIst-Zustand\nWie beurteilen wir den Ist-Zustand?",null,null,"3. Priorisierung\nMit welcher Priorität möchten wir uns verbessern?",null,null,"4. Begründung \nBitte begründen Sie Ihre Einschätzungen.\n\n",null,null,""]
[null,null,null,null,null,null,null,null,null,null,null,null,null,null,null,""]
[null,"Sind die Behandlungs- und Beratungsangebote der verschiedenen Institutionen gut koordiniert?",null,null,null,null,null,{"$f":"IF(G78=$G$6,\"Irrelevant\",IF(G78=$G$5,1,IF(G78=$G$4,2,IF(G78=$G$3,3,IF(G78=$G$2,4,IF(G78=$G$1,5,\"\"))))))","v":""},null,null,{"$f":"IF(J78=$J$1,2,IF(J78=$J$2,1,IF(J78=$J$3,0,\"\")))","v":""},null,null,null,null,"","Koordination der Bemühungen verschiedener Institutionen (Behandlung und soziale Integration)","Handlungsfeld 3",3,"Bereitstellung von spezifischen Behandlungs- und Beratungsangeboten"]
[null,"Werden adäquate Behandlungsangebote für verschiedene Zielgruppen (Kinder und Jugendliche, Erwachsene, ältere Personen, Migranten/-innen usw.) bereitgestellt? ",null,null,null,null,null,null,null,null,null,null,null,null,null,""]
[null,null,null,null,null,null,null,{"$f":"IF(G80=$G$6,\"Irrelevant\",IF(G80=$G$5,1,IF(G80=$G$4,2,IF(G80=$G$3,3,IF(G80=$G$2,4,IF(G80=$G$1,5,\"\"))))))","v":""},null,null,{"$f":"IF(J80=$J$1,2,IF(J80=$J$2,1,IF(J80=$J$3,0,\"\")))","v":""},null,null,null,null,"","Adäquate Behandlungsangebote (Behandlung und soziale Integration)","Handlungsfeld 3",3,"Bereitstellung von spezifischen Behandlungs- und Beratungsangeboten"]
[null,null,null,null,null,null,null,null,null,null,null,null,null,null,null,""]
[null,"Werden adäquate Beratungsangebote für verschiedene Zielgruppen (Kinder und Jugendliche, Erwachsene, ältere Personen, Migranten/-innen usw.) bereitgestellt?",null,null,null,null,null,{"$f":"IF(G82=$G$6,\"Irrelevant\",IF(G82=$G$5,1,IF(G82=$G$4,2,IF(G82=$G$3,3,IF(G82=$G$2,4,IF(G82=$G$1,5,\"\"))))))","v":""},null,null,{"$f":"IF(J82=$J$1,2,IF(J82=$J$2,1,IF(J82=$J$3,0,\"\")))","v":""},null,null,null,null,"","Adäquate Beratungsangebote (Behandlung und soziale Integration)","Handlungsfeld 3",3,"Bereitstellung von spezifischen Behandlungs- und Beratungsangeboten"]
[null,null,null,null,null,null,null,null,null,null,null,null,null,null,null,""]
[null,"Weiterer Faktor zu diesem Schwerpunkt? \nBitte hier eintragen",null,null,null,null,null,{"$f":"IF(G84=$G$6,\"Irrelevant\",IF(G84=$G$5,1,IF(G84=$G$4,2,IF(G84=$G$3,3,IF(G84=$G$2,4,IF(G84=$G$1,5,\"\"))))))","v":""},null,null,{"$f":"IF(J84=$J$1,2,IF(J84=$J$2,1,IF(J84=$J$3,0,\"\")))","v":""},null,null,null,null,"",{"$f":"B84","v":"Weiterer Faktor zu diesem Schwerpunkt? \nBitte hier eintragen"},"Handlungsfeld 3",3,"Bereitstellung von spezifischen Behandlungs- und Beratungsangeboten"]
[]
[null,"Gesamtbeurteilung: Wie beurteilen wir unseren Kanton insgesamt in Bezug auf die Bereitstellung von spezifischen Behandlungs- und Beratungsangeboten?",null,null,null,null,null,null,null,null,null,null,null,null,null,""]
[null,null,null,null,null,null,null,{"$f":"IF(G87=$G$6,\"Irrelevant\",IF(G87=$G$5,1,IF(G87=$G$4,2,IF(G87=$G$3,3,IF(G87=$G$2,4,IF(G87=$G$1,5,\"\"))))))","v":""},null,null,{"$f":"IF(J87=$J$1,2,IF(J87=$J$2,1,IF(J87=$J$3,0,\"\")))","v":""},null,null,null,null,""]
[null,null,null,null,null,null,null,null,null,null,null,null,null,null,null,""]
[null,null,null,null,null,null,null,null,null,null,null,null,null,null,null,""]
[null,null,null,null,null,null,null,null,null,null,null,null,null,null,null,""]
[null,null,null,"Handlungsfeld 4: Individuelle und gesellschaftliche Schadensminderung",null,null,null,null,null,null,null,null,null,null,null,{"$f":"IF(H91=\"\",\"\",IF(K91=\"\",\"\",IF(H91+K91>=5,5,H91+K91)))","v":""}]
[null,"Vermeidung von gesundheitlichen Folgen des Alkoholkonsums",null,null,"1. Bestandes-\naufnahme\nHaben/machen wir bereits etwas?",null,"2. Beurteilung  \nIst-Zustand\nWie beurteilen wir den Ist-Zustand?",null,null,"3. Priorisierung\nMit welcher Priorität möchten wir uns verbessern?",null,null,"4. Begründung \nBitte begründen Sie Ihre Einschätzungen.\n\n",null,null,""]
[null,"Werden adäquate Massnahmen zur Prävention von Alkoholmissbrauch und Abhängigkeit bei verschiedenen Zielgruppen (Jugendlichen, Erwachsenen, älteren Personen, Migranten/-innen, usw.) umgesetzt?",null,null,null,null,null,null,null,null,null,null,null,null,null,""]
[null,null,null,null,null,null,null,{"$f":"IF(G94=$G$6,\"Irrelevant\",IF(G94=$G$5,1,IF(G94=$G$4,2,IF(G94=$G$3,3,IF(G94=$G$2,4,IF(G94=$G$1,5,\"\"))))))","v":""},null,null,{"$f":"IF(J94=$J$1,2,IF(J94=$J$2,1,IF(J94=$J$3,0,\"\")))","v":""},null,null,null,null,"","Massnahmen zur Prävention von Alkoholmissbrauch und Abhängigkeit (Individ. und gesellsch. Schadensminderung)","Handlungsfeld 4",4,"Vermeidung von gesundheitlichen Folgen des \nAlkoholkonsums\n"]
[null,null,null,null,null,null,null,null,null,null,null,null,null,null,null,""]
[null,"Werden Massnahmen zur Prävention von Alkohol und Gewalt umgesetzt?",null,null,null,null,null,{"$f":"IF(G96=$G$6,\"Irrelevant\",IF(G96=$G$5,1,IF(G96=$G$4,2,IF(G96=$G$3,3,IF(G96=$G$2,4,IF(G96=$G$1,5,\"\"))))))","v":""},null,null,{"$f":"IF(J96=$J$1,2,IF(J96=$J$2,1,IF(J96=$J$3,0,\"\")))","v":""},null,null,null,null,"","Massnahmen zur Prävention von Alkohol und Gewalt (Individ. und gesellsch. Schadensminderung)","Handlungsfeld 4",4,"Vermeidung von gesundheitlichen Folgen des \nAlkoholkonsums\n"]
[null,null,null,null,null,null,null,null,null,null,null,null,null,null,null,""]
[null,"Werden Massnahmen zur Prävention von Mischkonsum (Alkohol und Drogen) umgesetzt?",null,null,null,null,null,{"$f":"IF(G98=$G$6,\"Irrelevant\",IF(G98=$G$5,1,IF(G98=$G$4,2,IF(G98=$G$3,3,IF(G98=$G$2,4,IF(G98=$G$1,5,\"\"))))))","v":""},null,null,{"$f":"IF(J98=$J$1,2,IF(J98=$J$2,1,IF(J98=$J$3,0,\"\")))","v":""},null,null,null,null,"","Massnahmen zur Prävention von Mischkonsum (Individ. und gesellsch. Schadensminderung)","Handlungsfeld 4",4,"Vermeidung von gesundheitlichen Folgen des \nAlkoholkonsums\n"]
[null,null,null,null,null,null,null,null,null,null,null,null,null,null,null,""]
[null,"Werden Massnahmen in Bezug auf Alkohol und Sexualität umgesetzt? ",null,null,null,null,null,{"$f":"IF(G100=$G$6,\"Irrelevant\",IF(G100=$G$5,1,IF(G100=$G$4,2,IF(G100=$G$3,3,IF(G100=$G$2,4,IF(G100=$G$1,5,\"\"))))))","v":""},null,null,{"$f":"IF(J100=$J$1,2,IF(J100=$J$2,1,IF(J100=$J$3,0,\"\")))","v":""},null,null,null,null,"","Massnahmen in Bezug auf Alkohol und Sexualität (Individ. und gesellsch. Schadensminderung)","Handlungsfeld 4",4,"Vermeidung von gesundheitlichen Folgen des \nAlkoholkonsums\n"]
[null,null,null,null,null,null,null,null,null,null,null,null,null,null,null,""]
[null,"Werden die Gelder aus dem Alkoholzehntel zweckgebunden und wirkungsorientiert verwendet? ",null,null,null,null,null,{"$f":"IF(G102=$G$6,\"Irrelevant\",IF(G102=$G$5,1,IF(G102=$G$4,2,IF(G102=$G$3,3,IF(G102=$G$2,4,IF(G102=$G$1,5,\"\"))))))","v":""},null,null,{"$f":"IF(J102=$J$1,2,IF(J102=$J$2,1,IF(J102=$J$3,0,\"\")))","v":""},null,null,null,null,"","Zweckgebundene Verwendung der Gelder aus dem Alkoholzehntel (Individ. und gesellsch. Schadensminderung)","Handlungsfeld 4",4,"Vermeidung von gesundheitlichen Folgen des \nAlkoholkonsums\n"]
[null,null,null,null,null,null,null,null,null,null,null,null,null,null,null,""]
[null,"Weiterer Faktor zu diesem Schwerpunkt? \nBitte hier eintragen",null,null,null,null,null,{"$f":"IF(G104=$G$6,\"Irrelevant\",IF(G104=$G$5,1,IF(G104=$G$4,2,IF(G104=$G$3,3,IF(G104=$G$2,4,IF(G104=$G$1,5,\"\"))))))","v":""},null,null,{"$f":"IF(J104=$J$1,2,IF(J104=$J$2,1,IF(J104=$J$3,0,\"\")))","v":""},null,null,null,null,"",{"$f":"B104","v":"Weiterer Faktor zu diesem Schwerpunkt? \nBitte hier eintragen"},"Handlungsfeld 4",4,"Vermeidung von gesundheitlichen Folgen des \nAlkoholkonsums\n"]
[]
[null,"Gesamtbeurteilung: Wie beurteilen wir unseren Kanton insgesamt in Bezug auf die Vermeidung von gesundheitlichen Folgen des Alkoholkonsums? ",null,null,null,null,null,null,null,null,null,null,null,null,null,""]
[null,null,null,null,null,null,null,{"$f":"IF(G107=$G$6,\"Irrelevant\",IF(G107=$G$5,1,IF(G107=$G$4,2,IF(G107=$G$3,3,IF(G107=$G$2,4,IF(G107=$G$1,5,\"\"))))))","v":""},null,null,{"$f":"IF(J107=$J$1,2,IF(J107=$J$2,1,IF(J107=$J$3,0,\"\")))","v":""},null,null,null,null,""]
[null,null,null,null,null,null,null,null,null,null,null,null,null,null,null,""]
[null,null,null,null,null,null,null,null,null,null,null,null,null,null,null,""]
[null,null,null,null,null,null,null,null,null,null,null,null,null,null,null,""]
[null,"Gewährleistung der Sicherheit im öffentlichen Raum",null,null,"1. Bestandes-\naufnahme\nHaben/machen wir bereits etwas?",null,"2. Beurteilung  \nIst-Zustand\nWie beurteilen wir den Ist-Zustand?",null,null,"3. Priorisierung\nMit welcher Priorität möchten wir uns verbessern?",null,null,"4. Begründung \nBitte begründen Sie Ihre Einschätzungen.\n\n",null,null,""]
[null,null,null,null,null,null,null,null,null,null,null,null,null,null,null,""]
[null,"Werden Sicherheitskonzepte mit alkoholspezifischen Massnahmen an (Gross-)Veranstaltungen durchgesetzt?",null,null,null,null,null,{"$f":"IF(G113=$G$6,\"Irrelevant\",IF(G113=$G$5,1,IF(G113=$G$4,2,IF(G113=$G$3,3,IF(G113=$G$2,4,IF(G113=$G$1,5,\"\"))))))","v":""},null,null,{"$f":"IF(J113=$J$1,2,IF(J113=$J$2,1,IF(J113=$J$3,0,\"\")))","v":""},null,null,null,null,"","Sicherheitskonzepte an (Gross-)Veranstaltungen (Individ. und gesellsch. Schadensminderung)","Handlungsfeld 4",4,"Gewährleistung der Sicherheit im öffentlichen Raum"]
[null,"Arbeiten die Akteure, welche im öffentlichen Raum Berührungspunkte mit der Thematik Alkohol und seinen Folgen aufweisen, zur Gewährleistung der öffentlichen Sicherheit zusammen?",null,null,null,null,null,null,null,null,null,null,null,null,null,""]
[null,null,null,null,null,null,null,{"$f":"IF(G115=$G$6,\"Irrelevant\",IF(G115=$G$5,1,IF(G115=$G$4,2,IF(G115=$G$3,3,IF(G115=$G$2,4,IF(G115=$G$1,5,\"\"))))))","v":""},null,null,{"$f":"IF(J115=$J$1,2,IF(J115=$J$2,1,IF(J115=$J$3,0,\"\")))","v":""},null,null,null,null,"","Zusammenarbeit der Akteure im öffentlichen Raum (Individ. und gesellsch. Schadensminderung)","Handlungsfeld 4",4,"Gewährleistung der Sicherheit im öffentlichen Raum"]
[null,null,null,null,null,null,null,null,null,null,null,null,null,null,null,""]
[null,"Gibt es ein Alkoholverbot im und um Sportstadien (Rayon) anlässlich (Hoch-)Risikospielen im Fussball und Eishockey?",null,null,null,null,null,{"$f":"IF(G117=$G$6,\"Irrelevant\",IF(G117=$G$5,1,IF(G117=$G$4,2,IF(G117=$G$3,3,IF(G117=$G$2,4,IF(G117=$G$1,5,\"\"))))))","v":""},null,null,{"$f":"IF(J117=$J$1,2,IF(J117=$J$2,1,IF(J117=$J$3,0,\"\")))","v":""},null,null,null,null,"","Alkoholverbot rund um Sportstadien (Individ. und gesellsch. Schadensminderung)","Handlungsfeld 4",4,"Gewährleistung der Sicherheit im öffentlichen Raum"]
[null,null,null,null,null,null,null,null,null,null,null,null,null,null,null,""]
[null,"Weiterer Faktor zu diesem Schwerpunkt? \nBitte hier eintragen",null,null,null,null,null,{"$f":"IF(G119=$G$6,\"Irrelevant\",IF(G119=$G$5,1,IF(G119=$G$4,2,IF(G119=$G$3,3,IF(G119=$G$2,4,IF(G119=$G$1,5,\"\"))))))","v":""},null,null,{"$f":"IF(J119=$J$1,2,IF(J119=$J$2,1,IF(J119=$J$3,0,\"\")))","v":""},null,null,null,null,"",{"$f":"B119","v":"Weiterer Faktor zu diesem Schwerpunkt? \nBitte hier eintragen"},"Handlungsfeld 4",4,"Gewährleistung der Sicherheit im öffentlichen Raum"]
[]
[null,"Gesamtbeurteilung: Wie beurteilen wir unseren Kanton insgesamt in Bezug auf die Gewährleistung der Sicherheit im öffentlichen Raum?",null,null,null,null,null,null,null,null,null,null,null,null,null,""]
[null,null,null,null,null,null,null,{"$f":"IF(G122=$G$6,\"Irrelevant\",IF(G122=$G$5,1,IF(G122=$G$4,2,IF(G122=$G$3,3,IF(G122=$G$2,4,IF(G122=$G$1,5,\"\"))))))","v":""},null,null,{"$f":"IF(J122=$J$1,2,IF(J122=$J$2,1,IF(J122=$J$3,0,\"\")))","v":""},null,null,null,null,""]
[null,null,null,null,null,null,null,null,null,null,null,null,null,null,null,""]
[null,null,null,null,null,null,null,null,null,null,null,null,null,null,null,""]
[null,null,null,null,null,null,null,null,null,null,null,null,null,null,null,""]
[null,"Vollzug geltender Bestimmungen ",null,null,"1. Bestandes-\naufnahme\nHaben/machen wir bereits etwas?",null,"2. Beurteilung  \nIst-Zustand\nWie beurteilen wir den Ist-Zustand?",null,null,"3. Priorisierung\nMit welcher Priorität möchten wir uns verbessern?",null,null,"4. Begründung \nBitte begründen Sie Ihre Einschätzungen.\n\n",null,null,""]
[null,null,null,null,null,null,null,null,null,null,null,null,null,null,null,""]
[null,"Werden geltende Bestimmungen im Strassenverkehr konsequent vollzogen?",null,null,null,null,null,{"$f":"IF(G128=$G$6,\"Irrelevant\",IF(G128=$G$5,1,IF(G128=$G$4,2,IF(G128=$G$3,3,IF(G128=$G$2,4,IF(G128=$G$1,5,\"\"))))))","v":""},null,null,{"$f":"IF(J128=$J$1,2,IF(J128=$J$2,1,IF(J128=$J$3,0,\"\")))","v":""},null,null,null,null,"","Vollzug geltender Bestimmungen im Strassenverkehr (Individ. und gesellsch. Schadensminderung)","Handlungsfeld 4",4,"Vollzug geltender Bestimmungen"]
[null,null,null,null,null,null,null,null,null,null,null,null,null,null,null,""]
[null,"Werden geltende Jugendschutzbestimmungen (z.B. an Sportveranstaltungen, Konzerten, Festivals, Festaktivitäten) konsequent vollzogen? ",null,null,null,null,null,{"$f":"IF(G130=$G$6,\"Irrelevant\",IF(G130=$G$5,1,IF(G130=$G$4,2,IF(G130=$G$3,3,IF(G130=$G$2,4,IF(G130=$G$1,5,\"\"))))))","v":""},null,null,{"$f":"IF(J130=$J$1,2,IF(J130=$J$2,1,IF(J130=$J$3,0,\"\")))","v":""},null,null,null,null,"","Vollzug geltender Jugendschutzbestimmungen (Individ. und gesellsch. Schadensminderung)","Handlungsfeld 4",4,"Vollzug geltender Bestimmungen"]
[null,null,null,null,null,null,null,null,null,null,null,null,null,null,null,""]
[null,"Werden unangekündigte Testkäufe durchgeführt?",null,null,null,null,null,{"$f":"IF(G132=$G$6,\"Irrelevant\",IF(G132=$G$5,1,IF(G132=$G$4,2,IF(G132=$G$3,3,IF(G132=$G$2,4,IF(G132=$G$1,5,\"\"))))))","v":""},null,null,{"$f":"IF(J132=$J$1,2,IF(J132=$J$2,1,IF(J132=$J$3,0,\"\")))","v":""},null,null,null,null,"","Testkäufe (Individ. und gesellsch. Schadensminderung)","Handlungsfeld 4",4,"Vollzug geltender Bestimmungen"]
[null,null,null,null,null,null,null,null,null,null,null,null,null,null,null,""]
[null,"Weiterer Faktor zu diesem Schwerpunkt? \nBitte hier eintragen",null,null,null,null,null,{"$f":"IF(G134=$G$6,\"Irrelevant\",IF(G134=$G$5,1,IF(G134=$G$4,2,IF(G134=$G$3,3,IF(G134=$G$2,4,IF(G134=$G$1,5,\"\"))))))","v":""},null,null,{"$f":"IF(J134=$J$1,2,IF(J134=$J$2,1,IF(J134=$J$3,0,\"\")))","v":""},null,null,null,null,"",{"$f":"B134","v":"Weiterer Faktor zu diesem Schwerpunkt? \nBitte hier eintragen"},"Handlungsfeld 4",4,"Vollzug geltender Bestimmungen"]
[]
[null,"Gesamtbeurteilung: Wie beurteilen wir unseren Kanton insgesamt in Bezug auf den Vollzug geltender Bestimmungen?",null,null,null,null,null,null,null,null,null,null,null,null,null,""]
[null,null,null,null,null,null,null,{"$f":"IF(G137=$G$6,\"Irrelevant\",IF(G137=$G$5,1,IF(G137=$G$4,2,IF(G137=$G$3,3,IF(G137=$G$2,4,IF(G137=$G$1,5,\"\"))))))","v":""},null,null,{"$f":"IF(J137=$J$1,2,IF(J137=$J$2,1,IF(J137=$J$3,0,\"\")))","v":""},null,null,null,null,""]
[null,null,null,null,null,null,null,null,null,null,null,null,null,null,null,""]
[null,null,null,null,null,null,null,null,null,null,null,null,null,null,null,""]
[null,null,null,null,null,null,null,null,null,null,null,null,null,null,null,""]
[null,null,null,"Handlungsfeld 5: Marktregulierung und Jugendschutz ",null,null,null,null,null,null,null,null,null,null,null,""]
[null,"Einschränkung der Erhältlichkeit von alkoholischen Produkten",null,null,"1. Bestandes-\naufnahme\nHaben/machen wir bereits etwas?",null,"2. Beurteilung  \nIst-Zustand\nWie beurteilen wir den Ist-Zustand?",null,null,"3. Priorisierung\nMit welcher Priorität möchten wir uns verbessern?",null,null,"4. Begründung \nBitte begründen Sie Ihre Einschätzungen.\n\n",null,null,""]
[null,null,null,null,null,null,null,null,null,null,null,null,null,null,null,""]
[null,"Wird der Verkauf und/oder der Konsum von Alkohol zeitlich eingeschränkt? ",null,null,null,null,null,{"$f":"IF(G144=$G$6,\"Irrelevant\",IF(G144=$G$5,1,IF(G144=$G$4,2,IF(G144=$G$3,3,IF(G144=$G$2,4,IF(G144=$G$1,5,\"\"))))))","v":""},null,null,{"$f":"IF(J144=$J$1,2,IF(J144=$J$2,1,IF(J144=$J$3,0,\"\")))","v":""},null,null,null,null,"","Zeitliche Beschränkung von Verkauf/Konsum (Marktregulierung und Jugendschutz)","Handlungsfeld 5",5,"Einschränkung der Ehältlichkeit von alkoholischen Produkten"]
[null,null,null,null,null,null,null,null,null,null,null,null,null,null,null,""]
[null,"Wird der Verkauf und/oder der Konsum von Alkohol örtlich eingeschränkt?",null,null,null,null,null,{"$f":"IF(G146=$G$6,\"Irrelevant\",IF(G146=$G$5,1,IF(G146=$G$4,2,IF(G146=$G$3,3,IF(G146=$G$2,4,IF(G146=$G$1,5,\"\"))))))","v":""},null,null,{"$f":"IF(J146=$J$1,2,IF(J146=$J$2,1,IF(J146=$J$3,0,\"\")))","v":""},null,null,null,null,"","Örtliche Beschränkung von Verkauf/Konsum (Marktregulierung und Jugendschutz)","Handlungsfeld 5",5,"Einschränkung der Ehältlichkeit von alkoholischen Produkten"]
[null,null,null,null,null,null,null,null,null,null,null,null,null,null,null,""]
[null,"Gibt es ein Weitergabeverbot? ",null,null,null,null,null,{"$f":"IF(G148=$G$6,\"Irrelevant\",IF(G148=$G$5,1,IF(G148=$G$4,2,IF(G148=$G$3,3,IF(G148=$G$2,4,IF(G148=$G$1,5,\"\"))))))","v":""},null,null,{"$f":"IF(J148=$J$1,2,IF(J148=$J$2,1,IF(J148=$J$3,0,\"\")))","v":""},null,null,null,null,"","Weitergabeverbot (Marktregulierung und Jugendschutz)","Handlungsfeld 5",5,"Einschränkung der Ehältlichkeit von alkoholischen Produkten"]
[null,null,null,null,null,null,null,null,null,null,null,null,null,null,null,""]
[null,"Weiterer Faktor zu diesem Schwerpunkt? \nBitte hier eintragen",null,null,null,null,null,{"$f":"IF(G150=$G$6,\"Irrelevant\",IF(G150=$G$5,1,IF(G150=$G$4,2,IF(G150=$G$3,3,IF(G150=$G$2,4,IF(G150=$G$1,5,\"\"))))))","v":""},null,null,{"$f":"IF(J150=$J$1,2,IF(J150=$J$2,1,IF(J150=$J$3,0,\"\")))","v":""},null,null,null,null,"",{"$f":"B150","v":"Weiterer Faktor zu diesem Schwerpunkt? \nBitte hier eintragen"},"Handlungsfeld 5",5,"Einschränkung der Ehältlichkeit von alkoholischen Produkten"]
[]
[null,"Gesamtbeurteilung: Wie beurteilen wir unseren Kanton insgesamt in Bezug auf die Einschränkung der Erhältlichkeit von alkoholischen Produkten?",null,null,null,null,null,null,null,null,null,null,null,null,null,""]
[null,null,null,null,null,null,null,{"$f":"IF(G153=$G$6,\"Irrelevant\",IF(G153=$G$5,1,IF(G153=$G$4,2,IF(G153=$G$3,3,IF(G153=$G$2,4,IF(G153=$G$1,5,\"\"))))))","v":""},null,null,{"$f":"IF(J153=$J$1,2,IF(J153=$J$2,1,IF(J153=$J$3,0,\"\")))","v":""},null,null,null,null,""]
[null,null,null,null,null,null,null,null,null,null,null,null,null,null,null,""]
[null,null,null,null,null,null,null,null,null,null,null,null,null,null,null,""]
[null,null,null,null,null,null,null,null,null,null,null,null,null,null,null,""]
[null,"Einschränkung der Werbung für alkoholische Produkte",null,null,"1. Bestandes-\naufnahme\nHaben/machen wir bereits etwas?",null,"2. Beurteilung  \nIst-Zustand\nWie beurteilen wir den Ist-Zustand?",null,null,"3. Priorisierung\nMit welcher Priorität möchten wir uns verbessern?",null,null,"4. Begründung \nBitte begründen Sie Ihre Einschätzungen.\n\n",null,null,""]
[null,null,null,null,null,null,null,null,null,null,null,null,null,null,null,""]
[null,"Gibt es örtliche Werbeeinschränkungen? ",null,null,null,null,null,{"$f":"IF(G159=$G$6,\"Irrelevant\",IF(G159=$G$5,1,IF(G159=$G$4,2,IF(G159=$G$3,3,IF(G159=$G$2,4,IF(G159=$G$1,5,\"\"))))))","v":""},null,null,{"$f":"IF(J159=$J$1,2,IF(J159=$J$2,1,IF(J159=$J$3,0,\"\")))","v":""},null,null,null,null,"","Örtliche Werbeeinschränkung (Marktregulierung und Jugendschutz)","Handlungsfeld 5",5,"Einschränkung der Werbung für alkoholische Produkte"]
[null,null,null,null,null,null,null,null,null,null,null,null,null,null,null,""]
[null,"Gibt es Einschränkungen des Sponsorings?",null,null,null,null,null,{"$f":"IF(G161=$G$6,\"Irrelevant\",IF(G161=$G$5,1,IF(G161=$G$4,2,IF(G161=$G$3,3,IF(G161=$G$2,4,IF(G161=$G$1,5,\"\"))))))","v":""},null,null,{"$f":"IF(J161=$J$1,2,IF(J161=$J$2,1,IF(J161=$J$3,0,\"\")))","v":""},null,null,null,null,"","Einschränkung des Sponsorings (Marktregulierung und Jugendschutz)","Handlungsfeld 5",5,"Einschränkung der Werbung für alkoholische Produkte"]
[null,null,null,null,null,null,null,null,null,null,null,null,null,null,null,""]
[null,"Weiterer Faktor zu diesem Schwerpunkt? \nBitte hier eintragen",null,null,null,null,null,{"$f":"IF(G163=$G$6,\"Irrelevant\",IF(G163=$G$5,1,IF(G163=$G$4,2,IF(G163=$G$3,3,IF(G163=$G$2,4,IF(G163=$G$1,5,\"\"))))))","v":""},null,null,{"$f":"IF(J163=$J$1,2,IF(J163=$J$2,1,IF(J163=$J$3,0,\"\")))","v":""},null,null,null,null,{"$f":"IF(H163=\"\",\"\",IF(K163=\"\",\"\",IF(H163+K163>=5,5,H163+K163)))","v":""},{"$f":"B163","v":"Weiterer Faktor zu diesem Schwerpunkt? \nBitte hier eintragen"},"Handlungsfeld 5",5,"Einschränkung der Werbung für alkoholische Produkte"]
[]
[null,"Gesamtbeurteilung: Wie beurteilen wir unseren Kanton insgesamt in Bezug auf die Einschränkung der Werbung für alkoholische Produkte?",null,null,null,null,null,null,null,null,null,null,null,null,null,{"$f":"IF(H165=\"\",\"\",IF(K165=\"\",\"\",IF(H165+K165>=5,5,H165+K165)))","v":""}]
[null,null,null,null,null,null,null,{"$f":"IF(G166=$G$6,\"Irrelevant\",IF(G166=$G$5,1,IF(G166=$G$4,2,IF(G166=$G$3,3,IF(G166=$G$2,4,IF(G166=$G$1,5,\"\"))))))","v":""},null,null,{"$f":"IF(J166=$J$1,2,IF(J166=$J$2,1,IF(J166=$J$3,0,\"\")))","v":""},null,null,null,null,""]
[null,null,null,null,null,null,null,null,null,null,null,null,null,null,null,""]
[null,null,null,null,null,null,null,null,null,null,null,null,null,null,null,""]
[null,null,null,null,null,null,null,null,null,null,null,null,null,null,null,""]
[null,"Preisgestaltung für alkoholische Produkte ",null,null,"1. Bestandes-\naufnahme\nHaben/machen wir bereits etwas?",null,"2. Beurteilung  \nIst-Zustand\nWie beurteilen wir den Ist-Zustand?",null,null,"3. Priorisierung\nMit welcher Priorität möchten wir uns verbessern?",null,null,"4. Begründung \nBitte begründen Sie Ihre Einschätzungen.\n\n",null,null,""]
[null,null,null,null,null,null,null,null,null,null,null,null,null,null,null,""]
[null,"Wird das Verbot von \"Lockvogelangeboten\" konsequent durchgesetzt? ",null,null,null,null,null,{"$f":"IF(G172=$G$6,\"Irrelevant\",IF(G172=$G$5,1,IF(G172=$G$4,2,IF(G172=$G$3,3,IF(G172=$G$2,4,IF(G172=$G$1,5,\"\"))))))","v":""},null,null,{"$f":"IF(J172=$J$1,2,IF(J172=$J$2,1,IF(J172=$J$3,0,\"\")))","v":""},null,null,null,null,"","Verbot von Lockvogelangeboten (Marktregulierung und Jugendschutz)","Handlungsfeld 5",5,"Preisgestaltung für alkoholische Produkte"]
[null,null,null,null,null,null,null,null,null,null,null,null,null,null,null,""]
[null,"Gibt es einen \"Sirupartikel\"?  ",null,null,null,null,null,{"$f":"IF(G174=$G$6,\"Irrelevant\",IF(G174=$G$5,1,IF(G174=$G$4,2,IF(G174=$G$3,3,IF(G174=$G$2,4,IF(G174=$G$1,5,\"\"))))))","v":""},null,null,{"$f":"IF(J174=$J$1,2,IF(J174=$J$2,1,IF(J174=$J$3,0,\"\")))","v":""},null,null,null,null,"","Sirupartikel (Marktregulierung und Jugendschutz)","Handlungsfeld 5",5,"Preisgestaltung für alkoholische Produkte"]
[null,null,null,null,null,null,null,null,null,null,null,null,null,null,null,""]
[null,"Gibt es eine Sondergewerbesteuer auf alkoholische Getränke? ",null,null,null,null,null,{"$f":"IF(G176=$G$6,\"Irrelevant\",IF(G176=$G$5,1,IF(G176=$G$4,2,IF(G176=$G$3,3,IF(G176=$G$2,4,IF(G176=$G$1,5,\"\"))))))","v":""},null,null,{"$f":"IF(J176=$J$1,2,IF(J176=$J$2,1,IF(J176=$J$3,0,\"\")))","v":""},null,null,null,null,"","Sondergewerbesteuer (Marktregulierung und Jugendschutz)","Handlungsfeld 5",5,"Preisgestaltung für alkoholische Produkte"]
[null,null,null,null,null,null,null,null,null,null,null,null,null,null,null,""]
[null,"Weiterer Faktor zu diesem Schwerpunkt? \nBitte hier eintragen",null,null,null,null,null,{"$f":"IF(G178=$G$6,\"Irrelevant\",IF(G178=$G$5,1,IF(G178=$G$4,2,IF(G178=$G$3,3,IF(G178=$G$2,4,IF(G178=$G$1,5,\"\"))))))","v":""},null,null,{"$f":"IF(J178=$J$1,2,IF(J178=$J$2,1,IF(J178=$J$3,0,\"\")))","v":""},null,null,null,null,"",{"$f":"B178","v":"Weiterer Faktor zu diesem Schwerpunkt? \nBitte hier eintragen"},"Handlungsfeld 5",5,"Preisgestaltung für alkoholische Produkte"]
[]
[null,"Gesamtbeurteilung: Wie beurteilen wir unseren Kanton insgesamt in Bezug auf die Beeinflussung von Preisen für alkoholische Produkte?",null,null,null,null,null,null,null,null,null,null,null,null,null,""]
[null,null,null,null,null,null,null,{"$f":"IF(G181=$G$6,\"Irrelevant\",IF(G181=$G$5,1,IF(G181=$G$4,2,IF(G181=$G$3,3,IF(G181=$G$2,4,IF(G181=$G$1,5,\"\"))))))","v":""},null,null,{"$f":"IF(J181=$J$1,2,IF(J181=$J$2,1,IF(J181=$J$3,0,\"\")))","v":""},null,null,null,null,""]
[null,null,null,null,null,null,null,null,null,null,null,null,null,null,null,""]
[null,null,null,null,null,null,null,null,null,null,null,null,null,null,null,""]
[null,null,null,null,null,null,null,null,null,null,null,null,null,null,null,""]
[null,null,null,"Handlungsfeld 6: Information und Sensibilisierung",null,null,null,null,null,null,null,null,null,null,null,""]
[null,"Sensibilisierung und Information der Öffentlichkeit",null,null,"1. Bestandes-\naufnahme\nHaben/machen wir bereits etwas?",null,"2. Beurteilung  \nIst-Zustand\nWie beurteilen wir den Ist-Zustand?",null,null,"3. Priorisierung\nMit welcher Priorität möchten wir uns verbessern?",null,null,"4. Begründung \nBitte begründen Sie Ihre Einschätzungen.\n\n",null,null,""]
[null,null,null,null,null,null,null,null,null,null,null,null,null,null,null,""]
[null,"Werden Projekte und/oder Kampagnen zur Information und Sensibilisierung der Öffentlichkeit umgesetzt? ",null,null,null,null,null,{"$f":"IF(G188=$G$6,\"Irrelevant\",IF(G188=$G$5,1,IF(G188=$G$4,2,IF(G188=$G$3,3,IF(G188=$G$2,4,IF(G188=$G$1,5,\"\"))))))","v":""},null,null,{"$f":"IF(J188=$J$1,2,IF(J188=$J$2,1,IF(J188=$J$3,0,\"\")))","v":""},null,null,null,null,"","Information und Sensibilisierung der Öffentlichkeit (Information und Sensibilisierung)","Handlungsfeld 6",6,"Sensibilisierung und Information der Öffentlichkeit"]
[null,null,null,null,null,null,null,null,null,null,null,null,null,null,null,""]
[null,"Findet eine Information und Sensibilisierung in relevanten Settings wie Schulen, Vereinen, Betrieben, Gemeinden usw. statt?",null,null,null,null,null,{"$f":"IF(G190=$G$6,\"Irrelevant\",IF(G190=$G$5,1,IF(G190=$G$4,2,IF(G190=$G$3,3,IF(G190=$G$2,4,IF(G190=$G$1,5,\"\"))))))","v":""},null,null,{"$f":"IF(J190=$J$1,2,IF(J190=$J$2,1,IF(J190=$J$3,0,\"\")))","v":""},null,null,null,null,"","Information und Sensibilisierung in relevanten Settings (Information und Sensibilisierung)","Handlungsfeld 6",6,"Sensibilisierung und Information der Öffentlichkeit"]
[null,null,null,null,null,null,null,null,null,null,null,null,null,null,null,""]
[null,"Findet eine Kommunikation mit den Medien statt?",null,null,null,null,null,{"$f":"IF(G192=$G$6,\"Irrelevant\",IF(G192=$G$5,1,IF(G192=$G$4,2,IF(G192=$G$3,3,IF(G192=$G$2,4,IF(G192=$G$1,5,\"\"))))))","v":""},null,null,{"$f":"IF(J192=$J$1,2,IF(J192=$J$2,1,IF(J192=$J$3,0,\"\")))","v":""},null,null,null,null,"","Kommunikation mit Medien (Information und Sensibilisierung)","Handlungsfeld 6",6,"Sensibilisierung und Information der Öffentlichkeit"]
[null,null,null,null,null,null,null,null,null,null,null,null,null,null,null,""]
[null,"Weiterer Faktor zu diesem Schwerpunkt? \nBitte hier eintragen",null,null,null,null,null,{"$f":"IF(G194=$G$6,\"Irrelevant\",IF(G194=$G$5,1,IF(G194=$G$4,2,IF(G194=$G$3,3,IF(G194=$G$2,4,IF(G194=$G$1,5,\"\"))))))","v":""},null,null,{"$f":"IF(J194=$J$1,2,IF(J194=$J$2,1,IF(J194=$J$3,0,\"\")))","v":""},null,null,null,null,"",{"$f":"B194","v":"Weiterer Faktor zu diesem Schwerpunkt? \nBitte hier eintragen"},"Handlungsfeld 6",6,"Sensibilisierung und Information der Öffentlichkeit"]
[]
[null,"Gesamtbeurteilung: Wie beurteilen wir unseren Kanton insgesamt in Bezug auf die Sensibilisierung und Information der Öffentlichkeit?",null,null,null,null,null,null,null,null,null,null,null,null,null,""]
[null,null,null,null,null,null,null,{"$f":"IF(G197=$G$6,\"Irrelevant\",IF(G197=$G$5,1,IF(G197=$G$4,2,IF(G197=$G$3,3,IF(G197=$G$2,4,IF(G197=$G$1,5,\"\"))))))","v":""},null,null,{"$f":"IF(J197=$J$1,2,IF(J197=$J$2,1,IF(J197=$J$3,0,\"\")))","v":""},null,null,null,null,""]

{"sheet":"3 Chancen-Risiken-Analyse","index":2,"n_rows":73,"n_cols":10,"rows_kept":73,"cut":false,"hidden":false,"merged":[[69,1,70,1],[72,1,73,1],[54,1,55,1],[57,1,58,1],[60,1,61,1],[63,1,64,1],[66,1,67,1],[11,1,12,1],[40,1,41,1],[37,1,38,1],[51,1,52,1],[19,1,21,1],[25,1,27,1],[22,1,24,1],[28,1,31,1],[43,1,45,1]]}
[null,null,null,null,null,null,null,"Eher Chance"]
[null,null,null,null,null,null,null,"Eher Risiko"]
[null,null,null,null,null,null,null,"Neutral / Irrelevant"]
[]
[null,"Chancen-Risiken-Analyse"]
[null,"Identifizierung der Chancen und Risiken im Kanton (Rahmenbedingungen)"]
[]
[null,null,null,null,"Gesundheitliche Ebene"]
[null,"Wie charakterisieren wir den Kanton in Bezug\n auf …",null,null,null,"Bitte führen Sie Ihre Einschätzungen aus.",null,"Handelt es sich um eine Chance oder ein Risiko?",null,"Anmerkungen (z.B. Begründung, erwartete Veränderungen)"]
[]
[null,null,null,"Rahmenbedingung","cc","aa","bb","Einschätzung"]
[null,"den Alkoholkonsum pro Kopf im Kanton (Volumen und Häufigkeit)?",null,"Alkoholkonsum pro Kopf (Volumen/Häufigkeit)"]
[]
[]
[]
[]
[null,null,null,null,"Gesellschaftliche Ebene"]
[null,"Wie charakterisieren wir den Kanton in Bezug \nauf …",null,null,null,"Bitte führen Sie Ihre Einschätzungen aus.",null,"Handelt es sich um eine Chance oder ein Risiko?",null,"Anmerkungen (z.B. Begründung, erwartete Veränderungen)"]
[]
[null,"die Urbanität, das heisst die Verbreitung eines urbanen Lebensstils und städtischer Infrastruktur (Nachtleben, 24h-Gesellschaft usw.)?   ",null,"Urbanität"]
[]
[]
[null,"die Akzeptanz für alkoholpolitische Massnahmen in der Bevölkerung (z.B. beeinflusst durch kantonsspezifische Bräuche/Traditionen)?",null,"Akzeptanz für die Alkoholpolitik in der Bevölkerung"]
[]
[]
[null,"die Zentrumsfunktion und „Spätheimkehrerproblematik“ (z.B. in Bezug auf Nutzung Nachtzug/-bus oder Alkohol am Steuer)? ",null,"Zentrumsfunktion und \"Spätheimkehrerproblematik\""]
[]
[]
[null,"durch Statistiken dokumentierte Auffälligkeiten bzgl. Alkoholkonsum und Folgeschäden im Kanton (z.B. Spitaleinlieferungen von alkoholisierten Jugendlichen)?",null,"Auffällige Statistiken bezüglich Alkoholkonsum"]
[]
[]
[]
[]
[]
[null,null,null,null,"Wirtschaftliche Ebene"]
[null,"Wie charakterisieren wir den Kanton in Bezug \nauf …",null,null,null,"Bitte führen Sie Ihre Einschätzungen aus.",null,"Handelt es sich um eine Chance oder ein Risiko?",null,"Anmerkungen (z.B. Begründung, erwartete Veränderungen)"]
[]
[null,"die wirtschaftliche Bedeutung des Gastgewerbes?",null,"Wirtschaftliche Bedeutung des Gastgewerbes"]
[]
[]
[null,"die wirtschaftliche Bedeutung der Alkoholproduktion?",null,"Wirtschaftliche Bedeutung der Alkoholproduktion"]
[]
[]
[null,"die Kosten, die aufgrund von übermässigem Alkoholkonsum entstehen (z.B. Sicherheitskosten, Reinigungskosten, Krankheitskosten usw.)?",null,"Durch übermässigen Alkoholkonsum entstandene Kosten"]
[]
[]
[]
[]
[null,null,null,null,"Politische Ebene"]
[null,"Wie charakterisieren wir den Kanton in Bezug \nauf …",null,null,null,"Bitte führen Sie Ihre Einschätzungen aus.",null,"Handelt es sich um eine Chance oder ein Risiko?",null,"Anmerkungen (z.B. Begründung, erwartete Veränderungen)"]
[]
[null,"bestehende gesetzliche Grundlagen zur Alkoholpolitik (z.B. Jugendschutz, Werbeverbot)? ",null,"Gesetzliche Grundlagen zur Alkoholpolitik"]
[]
[]
[null,"die Unterstützung der Anliegen der Alkoholpolitik im Parlament?",null,"Unterstützung Alkoholpolitik im Parlament"]
[]
[]
[null,"die Unterstützung der Anliegen der Alkoholpolitik in der Regierung?",null,"Unterstützung Alkoholpolitik in Regierung"]
[]
[]
[null,"die Unterstützung der Anliegen der Alkoholpolitik in der Verwaltung?",null,"Unterstützung Alkoholpolitik in Verwaltung"]
[]
[]
[null,"die verfügbaren finanziellen und personellen Ressourcen für die Alkoholpolitik? ",null,"Finanzielle und personelle Ressourcen"]
[]
[]
[null,"die Präsenz der Präventionsgegnerschaft (Gewerbe, Vereine, Verbände) in Öffentlichkeit und Politik?",null,"Präsenz der Präventionsgegnerschaft"]
[]
[]
[null,"das Engagement von Pilotgemeinden (z.B. grosse Gemeinden mit weitreichender Autonomie) für die Alkoholpolitik?",null,"Engagement von Pilotgemeinden"]
[]
[]
[null,"das Engagement der Gemeinden für die Alkoholpolitik generell?",null,"Engagement grosser Gemeinden für Alkoholpolitik"]

{"sheet":"4 SWOT-Übersicht","index":3,"n_rows":103,"n_cols":31,"rows_kept":103,"cut":false,"hidden":false,"merged":[[4,2,4,5],[4,8,4,11]]}
[]
[null,null,"SWOT-Übersicht "]
[null,null,"Welche der identifizierten Stärken, Schwächen, Chancen und Risiken sind für unseren Kanton besonders relevant? (max. 6 pro Spalte)"]
[]
[null,null,"Aktivitäten",null,null,null,null,null,"Rahmenbedingungen",null,null,null,null,null,null,null,null,null,null,null,"IST-Zustand","(Mehrere Elemente)",null,"IST-Zustand","(Mehrere Elemente)"]
[null,null,"Stärken ",null,null,"Schwächen ",null,null,"Chancen",null,null,"Risiken ",null,null,"Prior Stärke","Prior Schwäche","Prior Chance","Prior Risiko",null,null,"Handlungsfelder","(Mehrere Elemente)",null,"Handlungsfelder","(Mehrere Elemente)",null,"Einschätzung","(Mehrere Elemente)",null,"Einschätzung","(Mehrere Elemente)"]
[null,null,"Stärken","a","b","Schwächen","c","d","Chancen","e","f","Risiken","g","h","Prior Stärke","Prior Schwäche","Prior Chance","Prior Risiko"]
[null,null,{"$f":"IF(OR(U$9=\"(Leer)\",U$9=\"Zeilenbeschriftungen\",U9=\"Weiterer Faktor zu diesem Schwerpunkt? \nBitte hier eintragen\"),IF(U10=\"\",\"\",U10),IF(U9=\"\",\"\",U9))","v":""},null,null,{"$f":"IF(OR(X$9=\"(Leer)\",X$9=\"Zeilenbeschriftungen\",X9=\"Weiterer Faktor zu diesem Schwerpunkt? \nBitte hier eintragen\"),IF(X10=\"\",\"\",X10),IF(X9=\"\",\"\",X9))","v":""},null,null,{"$f":"IF(OR(AA9=\"(Leer)\",AA9=\"Zeilenbeschriftungen\"),IF(AA10=\"\",\"\",AA10),IF(AA9=\"\",\"\",AA9))","v":""},null,null,{"$f":"IF(OR(AD9=\"(Leer)\",AD9=\"Zeilenbeschriftungen\"),IF(AD10=\"\",\"\",AD10),IF(AD9=\"\",\"\",AD9))","v":""},null,null,false,false,false,false,null,null,"Zeilenbeschriftungen","Summe von HF-Zahl",null,"Zeilenbeschriftungen","Summe von HF-Zahl",null,"Zeilenbeschriftungen",null,null,"Zeilenbeschriftungen"]
[null,null,{"$f":"IF(OR(U$9=\"(Leer)\",U$9=\"Zeilenbeschriftungen\",U10=\"Weiterer Faktor zu diesem Schwerpunkt? \nBitte hier eintragen\"),IF(U11=\"\",\"\",U11),IF(U10=\"\",\"\",U10))","v":""},null,null,{"$f":"IF(OR(X$9=\"(Leer)\",X$9=\"Zeilenbeschriftungen\",X10=\"Weiterer Faktor zu diesem Schwerpunkt? \nBitte hier eintragen\"),IF(X11=\"\",\"\",X11),IF(X10=\"\",\"\",X10))","v":""},null,null,{"$f":"IF(OR(AA9=\"(Leer)\",AA9=\"Zeilenbeschriftungen\"),IF(AA11=\"\",\"\",AA11),IF(AA10=\"\",\"\",AA10))","v":""},null,null,{"$f":"IF(OR(AD9=\"(Leer)\",AD9=\"Zeilenbeschriftungen\"),IF(AD11=\"\",\"\",AD11),IF(AD10=\"\",\"\",AD10))","v":""},null,null,false,false,false,false]
[null,null,{"$f":"IF(OR(U$9=\"(Leer)\",U$9=\"Zeilenbeschriftungen\",U11=\"Weiterer Faktor zu diesem Schwerpunkt? \nBitte hier eintragen\"),IF(U12=\"\",\"\",U12),IF(U11=\"\",\"\",U11))","v":""},null,null,{"$f":"IF(OR(X$9=\"(Leer)\",X$9=\"Zeilenbeschriftungen\",X11=\"Weiterer Faktor zu diesem Schwerpunkt? \nBitte hier eintragen\"),IF(X12=\"\",\"\",X12),IF(X11=\"\",\"\",X11))","v":""},null,null,{"$f":"IF(OR(AA9=\"(Leer)\",AA9=\"Zeilenbeschriftungen\"),IF(AA12=\"\",\"\",AA12),IF(AA11=\"\",\"\",AA11))","v":""},null,null,{"$f":"IF(OR(AD9=\"(Leer)\",AD9=\"Zeilenbeschriftungen\"),IF(AD12=\"\",\"\",AD12),IF(AD11=\"\",\"\",AD11))","v":""},null,null,false,false,false,false]
[null,null,{"$f":"IF(OR(U$9=\"(Leer)\",U$9=\"Zeilenbeschriftungen\",U12=\"Weiterer Faktor zu diesem Schwerpunkt? \nBitte hier eintragen\"),IF(U13=\"\",\"\",U13),IF(U12=\"\",\"\",U12))","v":""},null,null,{"$f":"IF(OR(X$9=\"(Leer)\",X$9=\"Zeilenbeschriftungen\",X12=\"Weiterer Faktor zu diesem Schwerpunkt? \nBitte hier eintragen\"),IF(X13=\"\",\"\",X13),IF(X12=\"\",\"\",X12))","v":""},null,null,{"$f":"IF(OR(AA9=\"(Leer)\",AA9=\"Zeilenbeschriftungen\"),IF(AA13=\"\",\"\",AA13),IF(AA12=\"\",\"\",AA12))","v":""},null,null,{"$f":"IF(OR(AD9=\"(Leer)\",AD9=\"Zeilenbeschriftungen\"),IF(AD13=\"\",\"\",AD13),IF(AD12=\"\",\"\",AD12))","v":""},null,null,false,false,false,false]
[null,null,"",null,null,"",null,null,{"$f":"IF(OR(AA9=\"(Leer)\",AA9=\"Zeilenbeschriftungen\"),IF(AA14=\"\",\"\",AA14),IF(AA13=\"\",\"\",AA13))","v":""},null,null,{"$f":"IF(OR(AD9=\"(Leer)\",AD9=\"Zeilenbeschriftungen\"),IF(AD14=\"\",\"\",AD14),IF(AD13=\"\",\"\",AD13))","v":""},null,null,false,false,false,false]
[null,null,"",null,null,"",null,null,{"$f":"IF(OR(AA9=\"(Leer)\",AA9=\"Zeilenbeschriftungen\"),IF(AA15=\"\",\"\",AA15),IF(AA14=\"\",\"\",AA14))","v":""},null,null,{"$f":"IF(OR(AD9=\"(Leer)\",AD9=\"Zeilenbeschriftungen\"),IF(AD15=\"\",\"\",AD15),IF(AD14=\"\",\"\",AD14))","v":""},null,null,false,false,false,false]
[null,null,"",null,null,"",null,null,{"$f":"IF(OR(AA9=\"(Leer)\",AA9=\"Zeilenbeschriftungen\"),IF(AA16=\"\",\"\",AA16),IF(AA15=\"\",\"\",AA15))","v":""},null,null,{"$f":"IF(OR(AD9=\"(Leer)\",AD9=\"Zeilenbeschriftungen\"),IF(AD16=\"\",\"\",AD16),IF(AD15=\"\",\"\",AD15))","v":""},null,null,false,false,false,false]
[null,null,"",null,null,"",null,null,{"$f":"IF(OR(AA9=\"(Leer)\",AA9=\"Zeilenbeschriftungen\"),IF(AA17=\"\",\"\",AA17),IF(AA16=\"\",\"\",AA16))","v":""},null,null,{"$f":"IF(OR(AD9=\"(Leer)\",AD9=\"Zeilenbeschriftungen\"),IF(AD17=\"\",\"\",AD17),IF(AD16=\"\",\"\",AD16))","v":""},null,null,false,false,false,false]
[null,null,"",null,null,"",null,null,{"$f":"IF(OR(AA9=\"(Leer)\",AA9=\"Zeilenbeschriftungen\"),IF(AA18=\"\",\"\",AA18),IF(AA17=\"\",\"\",AA17))","v":""},null,null,{"$f":"IF(OR(AD9=\"(Leer)\",AD9=\"Zeilenbeschriftungen\"),IF(AD18=\"\",\"\",AD18),IF(AD17=\"\",\"\",AD17))","v":""},null,null,false,false,false,false]
[null,null,"",null,null,"",null,null,{"$f":"IF(OR(AA9=\"(Leer)\",AA9=\"Zeilenbeschriftungen\"),IF(AA19=\"\",\"\",AA19),IF(AA18=\"\",\"\",AA18))","v":""},null,null,{"$f":"IF(OR(AD9=\"(Leer)\",AD9=\"Zeilenbeschriftungen\"),IF(AD19=\"\",\"\",AD19),IF(AD18=\"\",\"\",AD18))","v":""},null,null,false,false,false,false]
[null,null,"",null,null,"",null,null,{"$f":"IF(OR(AA9=\"(Leer)\",AA9=\"Zeilenbeschriftungen\"),IF(AA20=\"\",\"\",AA20),IF(AA19=\"\",\"\",AA19))","v":""},null,null,{"$f":"IF(OR(AD9=\"(Leer)\",AD9=\"Zeilenbeschriftungen\"),IF(AD20=\"\",\"\",AD20),IF(AD19=\"\",\"\",AD19))","v":""},null,null,false,false,false,false]
[null,null,"",null,null,"",null,null,{"$f":"IF(OR(AA9=\"(Leer)\",AA9=\"Zeilenbeschriftungen\"),IF(AA21=\"\",\"\",AA21),IF(AA20=\"\",\"\",AA20))","v":""},null,null,{"$f":"IF(OR(AD9=\"(Leer)\",AD9=\"Zeilenbeschriftungen\"),IF(AD21=\"\",\"\",AD21),IF(AD20=\"\",\"\",AD20))","v":""},null,null,false,false,false,false]
[null,null,"",null,null,"",null,null,{"$f":"IF(OR(AA9=\"(Leer)\",AA9=\"Zeilenbeschriftungen\"),IF(AA22=\"\",\"\",AA22),IF(AA21=\"\",\"\",AA21))","v":""},null,null,{"$f":"IF(OR(AD9=\"(Leer)\",AD9=\"Zeilenbeschriftungen\"),IF(AD22=\"\",\"\",AD22),IF(AD21=\"\",\"\",AD21))","v":""},null,null,false,false,false,false]
[null,null,"",null,null,"",null,null,{"$f":"IF(OR(AA9=\"(Leer)\",AA9=\"Zeilenbeschriftungen\"),IF(AA23=\"\",\"\",AA23),IF(AA22=\"\",\"\",AA22))","v":""},null,null,{"$f":"IF(OR(AD9=\"(Leer)\",AD9=\"Zeilenbeschriftungen\"),IF(AD23=\"\",\"\",AD23),IF(AD22=\"\",\"\",AD22))","v":""},null,null,false,false,false,false]
[null,null,"",null,null,"",null,null,{"$f":"IF(OR(AA9=\"(Leer)\",AA9=\"Zeilenbeschriftungen\"),IF(AA24=\"\",\"\",AA24),IF(AA23=\"\",\"\",AA23))","v":""},null,null,{"$f":"IF(OR(AD9=\"(Leer)\",AD9=\"Zeilenbeschriftungen\"),IF(AD24=\"\",\"\",AD24),IF(AD23=\"\",\"\",AD23))","v":""},null,null,false,false,false,false]
[null,null,"",null,null,"",null,null,{"$f":"IF(OR(AA9=\"(Leer)\",AA9=\"Zeilenbeschriftungen\"),IF(AA25=\"\",\"\",AA25),IF(AA24=\"\",\"\",AA24))","v":""},null,null,{"$f":"IF(OR(AD9=\"(Leer)\",AD9=\"Zeilenbeschriftungen\"),IF(AD25=\"\",\"\",AD25),IF(AD24=\"\",\"\",AD24))","v":""},null,null,false,false,false,false]
[null,null,"",null,null,"",null,null,{"$f":"IF(OR(AA9=\"(Leer)\",AA9=\"Zeilenbeschriftungen\"),IF(AA26=\"\",\"\",AA26),IF(AA25=\"\",\"\",AA25))","v":""},null,null,{"$f":"IF(OR(AD9=\"(Leer)\",AD9=\"Zeilenbeschriftungen\"),IF(AD26=\"\",\"\",AD26),IF(AD25=\"\",\"\",AD25))","v":""},null,null,false,false,false,false]
[null,null,"",null,null,"",null,null,{"$f":"IF(OR(AA9=\"(Leer)\",AA9=\"Zeilenbeschriftungen\"),IF(AA27=\"\",\"\",AA27),IF(AA26=\"\",\"\",AA26))","v":""},null,null,{"$f":"IF(OR(AD9=\"(Leer)\",AD9=\"Zeilenbeschriftungen\"),IF(AD27=\"\",\"\",AD27),IF(AD26=\"\",\"\",AD26))","v":""},null,null,false,false,false,false]
[null,null,"",null,null,"",null,null,{"$f":"IF(OR(AA9=\"(Leer)\",AA9=\"Zeilenbeschriftungen\"),IF(AA28=\"\",\"\",AA28),IF(AA27=\"\",\"\",AA27))","v":""},null,null,{"$f":"IF(OR(AD9=\"(Leer)\",AD9=\"Zeilenbeschriftungen\"),IF(AD28=\"\",\"\",AD28),IF(AD27=\"\",\"\",AD27))","v":""},null,null,false,false,false,false]
[null,null,"",null,null,"",null,null,{"$f":"IF(OR(AA9=\"(Leer)\",AA9=\"Zeilenbeschriftungen\"),IF(AA29=\"\",\"\",AA29),IF(AA28=\"\",\"\",AA28))","v":""},null,null,{"$f":"IF(OR(AD9=\"(Leer)\",AD9=\"Zeilenbeschriftungen\"),IF(AD29=\"\",\"\",AD29),IF(AD28=\"\",\"\",AD28))","v":""},null,null,false,false,false,false]
[null,null,"",null,null,"",null,null,{"$f":"IF(OR(AA9=\"(Leer)\",AA9=\"Zeilenbeschriftungen\"),IF(AA30=\"\",\"\",AA30),IF(AA29=\"\",\"\",AA29))","v":""},null,null,{"$f":"IF(OR(AD9=\"(Leer)\",AD9=\"Zeilenbeschriftungen\"),IF(AD30=\"\",\"\",AD30),IF(AD29=\"\",\"\",AD29))","v":""},null,null,false,false,false,false]
[null,null,"",null,null,"",null,null,{"$f":"IF(OR(AA9=\"(Leer)\",AA9=\"Zeilenbeschriftungen\"),IF(AA31=\"\",\"\",AA31),IF(AA30=\"\",\"\",AA30))","v":""},null,null,{"$f":"IF(OR(AD9=\"(Leer)\",AD9=\"Zeilenbeschriftungen\"),IF(AD31=\"\",\"\",AD31),IF(AD30=\"\",\"\",AD30))","v":""},null,null,false,false,false,false]
[null,null,"",null,null,"",null,null,{"$f":"IF(OR(AA9=\"(Leer)\",AA9=\"Zeilenbeschriftungen\"),IF(AA32=\"\",\"\",AA32),IF(AA31=\"\",\"\",AA31))","v":""},null,null,{"$f":"IF(OR(AD9=\"(Leer)\",AD9=\"Zeilenbeschriftungen\"),IF(AD32=\"\",\"\",AD32),IF(AD31=\"\",\"\",AD31))","v":""},null,null,false,false,false,false]
[null,null,"",null,null,"",null,null,{"$f":"IF(OR(AA9=\"(Leer)\",AA9=\"Zeilenbeschriftungen\"),IF(AA33=\"\",\"\",AA33),IF(AA32=\"\",\"\",AA32))","v":""},null,null,{"$f":"IF(OR(AD9=\"(Leer)\",AD9=\"Zeilenbeschriftungen\"),IF(AD33=\"\",\"\",AD33),IF(AD32=\"\",\"\",AD32))","v":""},null,null,false,false,false,false]
[null,null,"",null,null,"",null,null,{"$f":"IF(OR(AA9=\"(Leer)\",AA9=\"Zeilenbeschriftungen\"),IF(AA34=\"\",\"\",AA34),IF(AA33=\"\",\"\",AA33))","v":""},null,null,{"$f":"IF(OR(AD9=\"(Leer)\",AD9=\"Zeilenbeschriftungen\"),IF(AD34=\"\",\"\",AD34),IF(AD33=\"\",\"\",AD33))","v":""},null,null,false,false,false,false]
[null,null,"",null,null,"",null,null,{"$f":"IF(OR(AA9=\"(Leer)\",AA9=\"Zeilenbeschriftungen\"),IF(AA35=\"\",\"\",AA35),IF(AA34=\"\",\"\",AA34))","v":""},null,null,{"$f":"IF(OR(AD9=\"(Leer)\",AD9=\"Zeilenbeschriftungen\"),IF(AD35=\"\",\"\",AD35),IF(AD34=\"\",\"\",AD34))","v":""},null,null,false,false,false,false]
[null,null,"",null,null,"",null,null,{"$f":"IF(OR(AA9=\"(Leer)\",AA9=\"Zeilenbeschriftungen\"),IF(AA36=\"\",\"\",AA36),IF(AA35=\"\",\"\",AA35))","v":""},null,null,{"$f":"IF(OR(AD9=\"(Leer)\",AD9=\"Zeilenbeschriftungen\"),IF(AD36=\"\",\"\",AD36),IF(AD35=\"\",\"\",AD35))","v":""},null,null,false,false,false,false]
[null,null,"",null,null,"",null,null,{"$f":"IF(OR(AA9=\"(Leer)\",AA9=\"Zeilenbeschriftungen\"),IF(AA37=\"\",\"\",AA37),IF(AA36=\"\",\"\",AA36))","v":""},null,null,{"$f":"IF(OR(AD9=\"(Leer)\",AD9=\"Zeilenbeschriftungen\"),IF(AD37=\"\",\"\",AD37),IF(AD36=\"\",\"\",AD36))","v":""},null,null,false,false,false,false]
[null,null,"",null,null,"",null,null,{"$f":"IF(OR(AA9=\"(Leer)\",AA9=\"Zeilenbeschriftungen\"),IF(AA38=\"\",\"\",AA38),IF(AA37=\"\",\"\",AA37))","v":""},null,null,{"$f":"IF(OR(AD9=\"(Leer)\",AD9=\"Zeilenbeschriftungen\"),IF(AD38=\"\",\"\",AD38),IF(AD37=\"\",\"\",AD37))","v":""},null,null,false,false,false,false]
[null,null,"",null,null,"",null,null,{"$f":"IF(OR(AA9=\"(Leer)\",AA9=\"Zeilenbeschriftungen\"),IF(AA39=\"\",\"\",AA39),IF(AA38=\"\",\"\",AA38))","v":""},null,null,{"$f":"IF(OR(AD9=\"(Leer)\",AD9=\"Zeilenbeschriftungen\"),IF(AD39=\"\",\"\",AD39),IF(AD38=\"\",\"\",AD38))","v":""},null,null,false,false,false,false]
[null,null,"",null,null,"",null,null,{"$f":"IF(OR(AA9=\"(Leer)\",AA9=\"Zeilenbeschriftungen\"),IF(AA40=\"\",\"\",AA40),IF(AA39=\"\",\"\",AA39))","v":""},null,null,{"$f":"IF(OR(AD9=\"(Leer)\",AD9=\"Zeilenbeschriftungen\"),IF(AD40=\"\",\"\",AD40),IF(AD39=\"\",\"\",AD39))","v":""},null,null,false,false,false,false]
[null,null,"",null,null,"",null,null,{"$f":"IF(OR(AA9=\"(Leer)\",AA9=\"Zeilenbeschriftungen\"),IF(AA41=\"\",\"\",AA41),IF(AA40=\"\",\"\",AA40))","v":""},null,null,{"$f":"IF(OR(AD9=\"(Leer)\",AD9=\"Zeilenbeschriftungen\"),IF(AD41=\"\",\"\",AD41),IF(AD40=\"\",\"\",AD40))","v":""},null,null,false,false,false,false]
[]
[]
[]
[]
[]
[]
[]
[]
[]
[]
[]
[]
[]
[null,null,null,null,null,null,null,null,null,null,null,null,null,null,{"$f":"IF(AF54=\"\",\"\",AF54)","v":""},"","","",""]
[null,null,null,null,null,{"$f":"IF(X60=\"\",\"\",X60)","v":""},null,null,{"$f":"IF(AA55=\"\",\"\",AA55)","v":""},null,null,{"$f":"IF(AD55=\"\",\"\",AD55)","v":""},null,null,"","","","",""]
[null,null,null,null,null,{"$f":"IF(X61=\"\",\"\",X61)","v":""},null,null,{"$f":"IF(AA56=\"\",\"\",AA56)","v":""},null,null,{"$f":"IF(AD56=\"\",\"\",AD56)","v":""},null,null,"","","","",""]
[null,null,null,null,null,null,null,null,null,null,null,null,null,null,"","","","",""]
[null,null,null,null,null,null,null,null,null,null,null,null,null,null,"","","","",""]
[null,null,null,null,null,null,null,null,null,null,null,null,null,null,"","","","",""]
[null,null,null,null,null,null,null,null,null,null,null,null,null,null,"","","","",""]
[null,null,null,null,null,null,null,null,null,null,null,null,null,null,"","","","",""]
[null,null,null,null,null,null,null,null,null,null,null,null,null,null,"","","","",""]
[null,null,null,null,null,null,null,null,null,null,null,null,null,null,"","","","",""]
[null,null,null,null,null,null,null,null,null,null,null,null,null,null,"","","","",""]
[null,null,null,null,null,null,null,null,null,null,null,null,null,null,"","","","",""]
[null,null,null,null,null,null,null,null,null,null,null,null,null,null,"","","","",""]
[null,null,null,null,null,null,null,null,null,null,null,null,null,null,"","","","",""]
[null,null,null,null,null,null,null,null,null,null,null,null,null,null,"","","","",""]
[null,null,null,null,null,null,null,null,null,null,null,null,null,null,"","","","",""]
[null,null,null,null,null,null,null,null,null,null,null,null,null,null,{"$f":"IF(AF70=\"\",\"\",AF70)","v":""},"","","",""]
[null,null,null,null,null,null,null,null,null,null,null,null,null,null,"","","","",""]
[null,null,null,null,null,null,null,null,null,null,null,null,null,null,"","","","",""]
[null,null,null,null,null,null,null,null,null,null,null,null,null,null,"","","","",""]
[null,null,null,null,null,null,null,null,null,null,null,null,null,null,"","","","",""]
[null,null,null,null,null,null,null,null,null,null,null,null,null,null,"","","","",""]
[null,null,null,null,null,null,null,null,null,null,null,null,null,null,"","","","",""]
[null,null,null,null,null,null,null,null,null,null,null,null,null,null,"","","","",""]
[null,null,null,null,null,null,null,null,null,null,null,null,null,null,"","","","",""]
[null,null,null,null,null,null,null,null,null,null,null,null,null,null,"","","","",""]
[null,null,null,null,null,null,null,null,null,null,null,null,null,null,"","","","",""]
[null,null,null,null,null,null,null,null,null,null,null,null,null,null,"","","","",""]
[null,null,null,null,null,null,null,null,null,null,null,null,null,null,"","","","",""]
[null,null,null,null,null,null,null,null,null,null,null,null,null,null,"","","","",""]
[null,null,null,null,null,null,null,null,null,null,null,null,null,null,"","","","",""]
[null,null,null,null,null,null,null,null,null,null,null,null,null,null,"","","","",""]
[null,null,null,null,null,null,null,null,null,null,null,null,null,null,"","","","",""]
[null,null,null,null,null,null,null,null,null,null,null,null,null,null,"","","","",""]
[null,null,null,null,null,null,null,null,null,null,null,null,null,null,"","","","",""]
[null,null,null,null,null,null,null,null,null,null,null,null,null,null,"","","","",""]
[null,null,null,null,null,null,null,null,null,null,null,null,null,null,"","","","",""]
[null,null,null,null,null,null,null,null,null,null,null,null,null,null,"","","","",""]
[null,null,null,null,null,null,null,null,null,null,null,null,null,null,"","","","",""]
[null,null,null,null,null,null,null,null,null,null,null,null,null,null,"","","","",""]
[null,null,null,null,null,null,null,null,null,null,null,null,null,null,"","","","",""]
[null,null,null,null,null,null,null,null,null,null,null,null,null,null,"","","","",""]
[null,null,null,null,null,null,null,null,null,null,null,null,null,null,"","","","",""]
[null,null,null,null,null,null,null,null,null,null,null,null,null,null,"","","","",""]
[null,null,null,null,null,null,null,null,null,null,null,null,null,null,"","","","",""]
[null,null,null,null,null,null,null,null,null,null,null,null,null,null,"","","","",""]
[null,null,null,null,null,null,null,null,null,null,null,null,null,null,"","","","",""]
[null,null,null,null,null,null,null,null,null,null,null,null,null,null,"","","","",""]
[null,null,null,null,null,null,null,null,null,null,null,null,null,null,"","","","",""]
[null,null,null,null,null,null,null,null,null,null,null,null,null,null,"","","","",""]
[null,null,null,null,null,null,null,null,null,null,null,null,null,null,"","","","",""]

{"sheet":"5 SWOT-Matrix ausgeblendet","index":4,"n_rows":51,"n_cols":24,"rows_kept":51,"cut":false,"hidden":true,"merged":[]}
[]
[null,"SWOT-Matrix"]
[null,"Welche möglichen Strategien können wir durch die Kombination der Stärken und Schwächen mit den Chancen und Risiken entwickeln? ",null,null,null,null,null,null,null,null,"Prior Stärke","(Mehrere Elemente)",null,null,"Prior Schwäche","(Mehrere Elemente)",null,null,"Prior Chance","(Mehrere Elemente)",null,null,"Prior Risiko","(Mehrere Elemente)"]
[]
[null,null,null,"Chancen ",null,"Risiken ",null,null,null,null,"Zeilenbeschriftungen",null,null,null,"Zeilenbeschriftungen",null,null,null,"Zeilenbeschriftungen",null,null,null,"Zeilenbeschriftungen"]
[null,null,null,{"$f":"IF(S6=\"Zeilenbeschriftungen\",IF(S7=\"\",\"\",S7),IF(S6=\"\",\"\",S6))","v":""},null,{"$f":"IF(W6=\"Zeilenbeschriftungen\",IF(W7=\"\",\"\",W7),IF(W6=\"\",\"\",W6))","v":""}]
[null,null,null,{"$f":"IF(S6=\"Zeilenbeschriftungen\",IF(S8=\"\",\"\",S8),IF(S7=\"\",\"\",S7))","v":""},null,{"$f":"IF(W6=\"Zeilenbeschriftungen\",IF(W8=\"\",\"\",W8),IF(W7=\"\",\"\",W7))","v":""}]
[null,null,null,{"$f":"IF(S6=\"Zeilenbeschriftungen\",IF(S9=\"\",\"\",S9),IF(S8=\"\",\"\",S8))","v":""},null,{"$f":"IF(W6=\"Zeilenbeschriftungen\",IF(W9=\"\",\"\",W9),IF(W8=\"\",\"\",W8))","v":""}]
[null,null,null,{"$f":"IF(S6=\"Zeilenbeschriftungen\",IF(S10=\"\",\"\",S10),IF(S9=\"\",\"\",S9))","v":""},null,{"$f":"IF(W6=\"Zeilenbeschriftungen\",IF(W10=\"\",\"\",W10),IF(W9=\"\",\"\",W9))","v":""}]
[null,null,null,{"$f":"IF(S6=\"Zeilenbeschriftungen\",IF(S11=\"\",\"\",S11),IF(S10=\"\",\"\",S10))","v":""},null,{"$f":"IF(W6=\"Zeilenbeschriftungen\",IF(W11=\"\",\"\",W11),IF(W10=\"\",\"\",W10))","v":""}]
[null,null,null,{"$f":"IF(S11=\"\",\"\",S11)","v":""},null,{"$f":"IF(W11=\"Zeilenbeschriftungen\",IF(W12=\"\",\"\",W12),IF(W11=\"\",\"\",W11))","v":""}]
[null,null,null,"",null,""]
[null,null,null,"",null,""]
[null,"Stärken ",null,{"$f":"IF(S6=\"Zeilenbeschriftungen\",IF(S12=\"\",\"\",S12),IF(S11=\"\",\"\",S11))","v":""},null,{"$f":"IF(W6=\"Zeilenbeschriftungen\",IF(W12=\"\",\"\",W12),IF(W11=\"\",\"\",W11))","v":""}]
[null,{"$f":"IF(K6=\"Zeilenbeschriftungen\",IF(K7=\"\",\"\",K7),IF(K6=\"\",\"\",K6))","v":""}]
[null,{"$f":"IF(K6=\"Zeilenbeschriftungen\",IF(K8=\"\",\"\",K8),IF(K7=\"\",\"\",K7))","v":""}]
[null,{"$f":"IF(K6=\"Zeilenbeschriftungen\",IF(K9=\"\",\"\",K9),IF(K8=\"\",\"\",K8))","v":""}]
[null,{"$f":"IF(K6=\"Zeilenbeschriftungen\",IF(K10=\"\",\"\",K10),IF(K9=\"\",\"\",K9))","v":""},null,"Eigene Stärken einsetzen, um Chancen zu nutzen",null,"Folgen von Risiken minimieren durch die eigenen Stärken"]
[null,{"$f":"IF(K6=\"Zeilenbeschriftungen\",IF(K11=\"\",\"\",K11),IF(K10=\"\",\"\",K10))","v":""}]
[null,{"$f":"IF(K6=\"Zeilenbeschriftungen\",IF(K12=\"\",\"\",K12),IF(K11=\"\",\"\",K11))","v":""}]
[null,"Schwächen "]
[null,{"$f":"IF(O6=\"Zeilenbeschriftungen\",IF(O7=\"\",\"\",O7),IF(O6=\"\",\"\",O6))","v":""}]
[null,{"$f":"IF(O6=\"Zeilenbeschriftungen\",IF(O8=\"\",\"\",O8),IF(O7=\"\",\"\",O7))","v":""}]
[null,{"$f":"IF(O6=\"Zeilenbeschriftungen\",IF(O9=\"\",\"\",O9),IF(O8=\"\",\"\",O8))","v":""},null,"Schwächen überwinden, um Chancen auszunutzen ",null,"Risikobereiche und Schwächen meiden"]
[null,{"$f":"IF(O6=\"Zeilenbeschriftungen\",IF(O10=\"\",\"\",O10),IF(O9=\"\",\"\",O9))","v":""}]
[null,{"$f":"IF(O6=\"Zeilenbeschriftungen\",IF(O11=\"\",\"\",O11),IF(O10=\"\",\"\",O10))","v":""}]
[null,{"$f":"IF(O6=\"Zeilenbeschriftungen\",IF(O12=\"\",\"\",O12),IF(O11=\"\",\"\",O11))","v":""}]
[]
[null,{"$f":"IF(O11=\"\",\"\",O11)","v":""}]
[null,{"$f":"IF(O12=\"\",\"\",O12)","v":""}]
[null,{"$f":"IF(O13=\"\",\"\",O13)","v":""}]
[]
[]
[]
[]
[]
[]
[]
[]
[]
[]
[]
[]
[]
[]
[]
[]
[]
[]
[]
[null,"Verwaltungsexterne Stellen oder privatrechtliche Institutionen"]

{"sheet":"5 SWOT-Matrix","index":5,"n_rows":51,"n_cols":6,"rows_kept":51,"cut":false,"hidden":false,"merged":[]}
[]
[null,"SWOT-Matrix"]
[null,"Welche möglichen Strategien können wir durch die Kombination der Stärken und Schwächen mit den Chancen und Risiken entwickeln? "]
[]
[null,null,null,"Chancen ",null,"Risiken "]
[null,null,null,{"$f":"'5 SWOT-Matrix ausgeblendet'!D6","v":""},null,{"$f":"'5 SWOT-Matrix ausgeblendet'!F6","v":""}]
[null,null,null,{"$f":"'5 SWOT-Matrix ausgeblendet'!D7","v":""},null,{"$f":"'5 SWOT-Matrix ausgeblendet'!F7","v":""}]
[null,null,null,{"$f":"'5 SWOT-Matrix ausgeblendet'!D8","v":""},null,{"$f":"'5 SWOT-Matrix ausgeblendet'!F8","v":""}]
[null,null,null,{"$f":"'5 SWOT-Matrix ausgeblendet'!D9","v":""},null,{"$f":"'5 SWOT-Matrix ausgeblendet'!F9","v":""}]
[null,null,null,{"$f":"'5 SWOT-Matrix ausgeblendet'!D10","v":""},null,{"$f":"'5 SWOT-Matrix ausgeblendet'!F10","v":""}]
[null,null,null,{"$f":"'5 SWOT-Matrix ausgeblendet'!D11","v":""},null,{"$f":"'5 SWOT-Matrix ausgeblendet'!F11","v":""}]
[null,null,null,{"$f":"'5 SWOT-Matrix ausgeblendet'!D12","v":""},null,{"$f":"'5 SWOT-Matrix ausgeblendet'!F12","v":""}]
[null,null,null,{"$f":"'5 SWOT-Matrix ausgeblendet'!D13","v":""},null,{"$f":"'5 SWOT-Matrix ausgeblendet'!F13","v":""}]
[null,"Stärken ",null,{"$f":"'5 SWOT-Matrix ausgeblendet'!D14","v":""},null,{"$f":"'5 SWOT-Matrix ausgeblendet'!F14","v":""}]
[null,{"$f":"'5 SWOT-Matrix ausgeblendet'!B15","v":""},null,"Bitte in diesen Feldern mögliche Strategien eintragen",null,"Bitte in diesen Feldern mögliche Strategien eintragen"]
[null,{"$f":"'5 SWOT-Matrix ausgeblendet'!B16","v":""}]
[null,{"$f":"'5 SWOT-Matrix ausgeblendet'!B17","v":""}]
[null,{"$f":"'5 SWOT-Matrix ausgeblendet'!B18","v":""},null,"Eigene Stärken einsetzen, um Chancen zu nutzen",null,"Folgen von Risiken minimieren durch die eigenen Stärken"]
[null,{"$f":"'5 SWOT-Matrix ausgeblendet'!B19","v":""}]
[null,{"$f":"'5 SWOT-Matrix ausgeblendet'!B20","v":""}]
[null,"Schwächen "]
[null,{"$f":"'5 SWOT-Matrix ausgeblendet'!B22","v":""},null,"Bitte in diesen Feldern mögliche Strategien eintragen",null,"Bitte in diesen Feldern mögliche Strategien eintragen"]
[null,{"$f":"'5 SWOT-Matrix ausgeblendet'!B23","v":""}]
[null,{"$f":"'5 SWOT-Matrix ausgeblendet'!B24","v":""},null,"Schwächen überwinden, um Chancen auszunutzen ",null,"Risikobereiche und Schwächen meiden"]
[null,{"$f":"'5 SWOT-Matrix ausgeblendet'!B25","v":""}]
[null,{"$f":"'5 SWOT-Matrix ausgeblendet'!B26","v":""}]
[null,{"$f":"'5 SWOT-Matrix ausgeblendet'!B27","v":""}]
[]
[null,{"$f":"IF(#REF!=\"\",\"\",#REF!)","v":{"$error":"#REF!"}}]
[null,{"$f":"IF(#REF!=\"\",\"\",#REF!)","v":{"$error":"#REF!"}}]
[null,{"$f":"IF(#REF!=\"\",\"\",#REF!)","v":{"$error":"#REF!"}}]
[]
[]
[]
[]
[]
[]
[]
[]
[]
[]
[]
[]
[]
[]
[]
[]
[]
[]
[]
[null,"Verwaltungsexterne Stellen oder privatrechtliche Institutionen"]

{"sheet":"6 Berechnetes Spinnenprofil","index":6,"n_rows":3,"n_cols":2,"rows_kept":3,"cut":false,"hidden":false,"merged":[]}
[]
[null,"Berechnetes Spinnenprofil "]
[null,"basierend auf dem gemittelten Wert der Aktivitäten pro Handlungsschwerpunkt"]

{"sheet":"7 Einfaches Spinnenprofil","index":7,"n_rows":3,"n_cols":2,"rows_kept":3,"cut":false,"hidden":false,"merged":[]}
[]
[null,"Einfaches Spinnenprofil "]
[null,"basierend auf der Gesamtbeurteilung zu den Handlungsschwerpunkten"]

{"sheet":"8 Polaritätsprofil","index":8,"n_rows":3,"n_cols":2,"rows_kept":3,"cut":false,"hidden":false,"merged":[]}
[]
[null,"Polaritätsprofil"]
[null,"basierend auf dem gemittelten Wert der Aktivitäten pro Handlungsschwerpunkt"]

{"sheet":"9 Werte","index":9,"n_rows":89,"n_cols":13,"rows_kept":89,"cut":false,"hidden":false,"merged":[[0,5,0,6]]}
[]
[null,"Werte"]
[]
[]
[null,null,"Ist-Zustand","Priorität",null,"Berechnetes Spinnenprofil","Ist-Zustand","Priorität",null,"Y-Achse","Hilfsspalte 1","Hilfsspalte Y konstant halten","Hilfsspalte Labeling Antworten"]
[null,"Arbeiten zugunsten eines politischen Auftrags",{"$f":"AVERAGE(C7:C10)","v":{"$error":"#DIV/0!"}},{"$f":"IF((AVERAGE(D7:D10))<C6,C6,AVERAGE(D7:D10))","v":{"$error":"#DIV/0!"}},null,{"$f":"B6","v":"Arbeiten zugunsten eines politischen Auftrags"},{"$f":"C6","v":{"$error":"#DIV/0!"}},{"$f":"D6","v":{"$error":"#DIV/0!"}},null,1,12,1,"Sehr schlecht"]
[null,{"$f":"'2 Stärken-Schwächen-Analyse'!Q16","v":"Netzwerk von Interessengruppen für Anliegen der Alkoholpolitik (Führungsstärke und Entschlossenheit)"},{"$f":"'2 Stärken-Schwächen-Analyse'!H16","v":""},{"$f":"'2 Stärken-Schwächen-Analyse'!P16","v":""},null,{"$f":"B13","v":"Erarbeitung von strategischen Grundlagen und Evaluation der Aktivitäten"},{"$f":"C13","v":{"$error":"#DIV/0!"}},{"$f":"D13","v":{"$error":"#DIV/0!"}},null,2,12,1,"Eher schlecht"]
[null,{"$f":"'2 Stärken-Schwächen-Analyse'!Q18","v":"Vorarbeiten zugunsten eines politischen Auftrags (Führungsstärke und Entschlossenheit)"},{"$f":"'2 Stärken-Schwächen-Analyse'!H18","v":""},{"$f":"'2 Stärken-Schwächen-Analyse'!P18","v":""},null,{"$f":"B21","v":"Koordination der Aktivitäten der relevanten Akteure/-innen"},{"$f":"C21","v":{"$error":"#DIV/0!"}},{"$f":"D21","v":{"$error":"#DIV/0!"}},null,3,12,1,"Ausreichend"]
[null,{"$f":"'2 Stärken-Schwächen-Analyse'!Q20","v":"Nutzung von Chancen in der Politik (Führungsstärke und Entschlossenheit)"},{"$f":"'2 Stärken-Schwächen-Analyse'!H20","v":""},{"$f":"'2 Stärken-Schwächen-Analyse'!P20","v":""},null,{"$f":"B28","v":"Früherkennung und Frühintervention in verschiedenen gesellschaftlichen Kontexten"},{"$f":"C28","v":{"$error":"#DIV/0!"}},{"$f":"D28","v":{"$error":"#DIV/0!"}},null,4,12,1,"Eher gut"]
[null,{"$f":"IF('2 Stärken-Schwächen-Analyse'!B22=\"Weiterer Faktor zu diesem Schwerpunkt? \nBitte hier eintragen\",\"Weiterer Faktor zu diesem Schwerpunkt (optional)\",'2 Stärken-Schwächen-Analyse'!B22)","v":"Weiterer Faktor zu diesem Schwerpunkt (optional)"},{"$f":"'2 Stärken-Schwächen-Analyse'!H22","v":""},{"$f":"'2 Stärken-Schwächen-Analyse'!P22","v":""},null,{"$f":"B34","v":"Bereitstellung von spezifischen Behandlungs- und Beratungsangeboten"},{"$f":"C34","v":{"$error":"#DIV/0!"}},{"$f":"D34","v":{"$error":"#DIV/0!"}},null,5,12,1,"Sehr gut"]
[null,"Beurteilung ingesamt",{"$f":"'2 Stärken-Schwächen-Analyse'!H25","v":""},{"$f":"'2 Stärken-Schwächen-Analyse'!P25","v":""},null,{"$f":"B41","v":"Vermeidung von gesundheitlichen Folgen des Alkoholkonsums"},{"$f":"C41","v":{"$error":"#DIV/0!"}},{"$f":"D41","v":{"$error":"#DIV/0!"}},null,6,1,1]
[null,null,null,null,null,{"$f":"B50","v":"Gewährleistung der Sicherheit im öffentlichen Raum"},{"$f":"C50","v":{"$error":"#DIV/0!"}},{"$f":"D50","v":{"$error":"#DIV/0!"}},null,7,1,1]
[null,"Erarbeitung von strategischen Grundlagen und Evaluation der Aktivitäten",{"$f":"AVERAGE(C14:C18)","v":{"$error":"#DIV/0!"}},{"$f":"IF((AVERAGE(D14:D18))<C13,C13,AVERAGE(D14:D18))","v":{"$error":"#DIV/0!"}},null,{"$f":"B57","v":"Vollzug geltender Bestimmungen"},{"$f":"C57","v":{"$error":"#DIV/0!"}},{"$f":"D57","v":{"$error":"#DIV/0!"}},null,8,1,1]
[null,{"$f":"'2 Stärken-Schwächen-Analyse'!Q31","v":"Strategische Grundlagen (Führungsstärke und Entschlossenheit)"},{"$f":"'2 Stärken-Schwächen-Analyse'!H31","v":""},{"$f":"'2 Stärken-Schwächen-Analyse'!P31","v":""},null,{"$f":"B64","v":"Einschränkung der Erhältlichkeit von alkoholischen Produkten"},{"$f":"C64","v":{"$error":"#DIV/0!"}},{"$f":"D64","v":{"$error":"#DIV/0!"}},null,9,1,1]
[null,{"$f":"'2 Stärken-Schwächen-Analyse'!Q33","v":"Daten zur Beurteilung des Handlungsbedarfs (Führungsstärke und Entschlossenheit)"},{"$f":"'2 Stärken-Schwächen-Analyse'!H33","v":""},{"$f":"'2 Stärken-Schwächen-Analyse'!P33","v":""},null,{"$f":"B71","v":"Einschränkung der Werbung für alkoholische Produkte"},{"$f":"C71","v":{"$error":"#DIV/0!"}},{"$f":"D71","v":{"$error":"#DIV/0!"}},null,10,1,1]
[null,{"$f":"'2 Stärken-Schwächen-Analyse'!Q35","v":"Einbezug relevanter Akteure (Führungsstärke und Entschlossenheit)"},{"$f":"'2 Stärken-Schwächen-Analyse'!H35","v":""},{"$f":"'2 Stärken-Schwächen-Analyse'!P35","v":""},null,{"$f":"B77","v":"Preisgestaltung für alkoholische Produkte"},{"$f":"C77","v":{"$error":"#DIV/0!"}},{"$f":"D77","v":{"$error":"#DIV/0!"}},null,11,1,1]
[null,{"$f":"'2 Stärken-Schwächen-Analyse'!Q37","v":"Evaluation bisheriger Tätigkeiten (Führungsstärke und Entschlossenheit)"},{"$f":"'2 Stärken-Schwächen-Analyse'!H37","v":""},{"$f":"'2 Stärken-Schwächen-Analyse'!P37","v":""},null,{"$f":"B84","v":"Sensibilisierung und Information der Öffentlichkeit"},{"$f":"C84","v":{"$error":"#DIV/0!"}},{"$f":"D84","v":{"$error":"#DIV/0!"}},null,12,1,1]
[null,{"$f":"IF('2 Stärken-Schwächen-Analyse'!B39=\"Weiterer Faktor zu diesem Schwerpunkt? \nBitte hier eintragen\",\"Weiterer Faktor zu diesem Schwerpunkt (optional)\",'2 Stärken-Schwächen-Analyse'!B39)","v":"Weiterer Faktor zu diesem Schwerpunkt (optional)"},{"$f":"'2 Stärken-Schwächen-Analyse'!H39","v":""},{"$f":"'2 Stärken-Schwächen-Analyse'!P39","v":""}]
[null,"Beurteilung insgesamt ",{"$f":"'2 Stärken-Schwächen-Analyse'!H42","v":""},{"$f":"'2 Stärken-Schwächen-Analyse'!P42","v":""}]
[]
[null,"Koordination der Aktivitäten der relevanten Akteure/-innen",{"$f":"AVERAGE(C22:C25)","v":{"$error":"#DIV/0!"}},{"$f":"IF((AVERAGE(D22:D25))<C21,C21,AVERAGE(D22:D25))","v":{"$error":"#DIV/0!"}}]
[null,{"$f":"'2 Stärken-Schwächen-Analyse'!Q48","v":"Verwaltungsinterne Zusammenarbeit (Führungsstärke und Entschlossenheit)"},{"$f":"'2 Stärken-Schwächen-Analyse'!H48","v":""},{"$f":"'2 Stärken-Schwächen-Analyse'!P48","v":""}]
[null,{"$f":"'2 Stärken-Schwächen-Analyse'!Q50","v":"Zusammenarbeit zwischen Kanton und Gemeinden (Führungsstärke und Entschlossenheit)"},{"$f":"'2 Stärken-Schwächen-Analyse'!H50","v":""},{"$f":"'2 Stärken-Schwächen-Analyse'!P50","v":""}]
[null,{"$f":"'2 Stärken-Schwächen-Analyse'!Q52","v":"Zusammenarbeit zwischen Verwaltung und anderen Ansprechpartnern (Führungsstärke und Entschlossenheit)"},{"$f":"'2 Stärken-Schwächen-Analyse'!H52","v":""},{"$f":"'2 Stärken-Schwächen-Analyse'!P52","v":""}]
[null,{"$f":"IF('2 Stärken-Schwächen-Analyse'!B54=\"Weiterer Faktor zu diesem Schwerpunkt? \nBitte hier eintragen\",\"Weiterer Faktor zu diesem Schwerpunkt (optional)\",'2 Stärken-Schwächen-Analyse'!B54)","v":"Weiterer Faktor zu diesem Schwerpunkt (optional)"},{"$f":"'2 Stärken-Schwächen-Analyse'!H54","v":""},{"$f":"'2 Stärken-Schwächen-Analyse'!P54","v":""},null,"Einfaches Spinnenprofil","Ist-Zustand","Priorität"]
[null,"Beurteilung insgesamt ",{"$f":"'2 Stärken-Schwächen-Analyse'!H57","v":""},{"$f":"'2 Stärken-Schwächen-Analyse'!P57","v":""},null,"Arbeiten zugunsten eines politischen Auftrags",{"$f":"C11","v":""},{"$f":"D11","v":""}]
[null,null,null,null,null,"Erarbeitung von strategische Grundlagen und Evaluation der Aktivitäten",{"$f":"C19","v":""},{"$f":"D19","v":""}]
[null,"Früherkennung und Frühintervention in verschiedenen gesellschaftlichen Kontexten",{"$f":"AVERAGE(C29:C31)","v":{"$error":"#DIV/0!"}},{"$f":"IF(AVERAGE(D29:D31)<C28,C28,AVERAGE(D29:D31))","v":{"$error":"#DIV/0!"}},null,"Koordination der Aktivitäten der relevanten Akteure/-innen",{"$f":"C26","v":""},{"$f":"D26","v":""}]
[null,{"$f":"'2 Stärken-Schwächen-Analyse'!Q64","v":"Massnahmen zur Früherkennung und Frühintervention (Gesundheitsschutz und Früherkennung)"},{"$f":"'2 Stärken-Schwächen-Analyse'!H64","v":""},{"$f":"'2 Stärken-Schwächen-Analyse'!P64","v":""},null,"Früherkennung und Frühintervention in verschiedenen gesellschaftlichen Kontexten",{"$f":"C32","v":""},{"$f":"D32","v":""}]
[null,{"$f":"'2 Stärken-Schwächen-Analyse'!Q66","v":"Massnahmen zur Sensibilisierung und Befähigung von Multiplikatoren/-innen (Gesundheitsschutz und Früherkennung)"},{"$f":"'2 Stärken-Schwächen-Analyse'!H66","v":""},{"$f":"'2 Stärken-Schwächen-Analyse'!P66","v":""},null,"Bereitstellung von spezifische Behandlungs- und Beratungsangeboten",{"$f":"C39","v":""},{"$f":"D39","v":""}]
[null,{"$f":"IF('2 Stärken-Schwächen-Analyse'!B68=\"Weiterer Faktor zu diesem Schwerpunkt? \nBitte hier eintragen\",\"Weiterer Faktor zu diesem Schwerpunkt (optional)\",'2 Stärken-Schwächen-Analyse'!B68)","v":"Weiterer Faktor zu diesem Schwerpunkt (optional)"},{"$f":"'2 Stärken-Schwächen-Analyse'!H68","v":""},{"$f":"'2 Stärken-Schwächen-Analyse'!P68","v":""},null,"Vermeidung von gesundheitlichen Folgen des Alkoholkonsums",{"$f":"C48","v":""},{"$f":"D48","v":""}]
[null,"Beurteilung insgesamt ",{"$f":"'2 Stärken-Schwächen-Analyse'!H71","v":""},{"$f":"'2 Stärken-Schwächen-Analyse'!P71","v":""},null,"Gewährleistung der Sicherheit im öffentlichen Raum",{"$f":"C55","v":""},{"$f":"D55","v":""}]
[null,null,null,null,null,"Vollzug geltender Bestimmungen",{"$f":"C62","v":""},{"$f":"D62","v":""}]
[null,"Bereitstellung von spezifischen Behandlungs- und Beratungsangeboten",{"$f":"AVERAGE(C35:C38)","v":{"$error":"#DIV/0!"}},{"$f":"IF(AVERAGE(D35:D38)<C34,C34,AVERAGE(D35:D38))","v":{"$error":"#DIV/0!"}},null,"Einschränkung der Erhältlichkeit von alkoholischen Produkten",{"$f":"C69","v":""},{"$f":"D69","v":""}]
[null,{"$f":"'2 Stärken-Schwächen-Analyse'!Q78","v":"Koordination der Bemühungen verschiedener Institutionen (Behandlung und soziale Integration)"},{"$f":"'2 Stärken-Schwächen-Analyse'!H78","v":""},{"$f":"'2 Stärken-Schwächen-Analyse'!P78","v":""},null,"Einschränkung der Werbung für alkoholische Produkte",{"$f":"C75","v":""},{"$f":"D75","v":""}]
[null,{"$f":"'2 Stärken-Schwächen-Analyse'!Q80","v":"Adäquate Behandlungsangebote (Behandlung und soziale Integration)"},{"$f":"'2 Stärken-Schwächen-Analyse'!H80","v":""},{"$f":"'2 Stärken-Schwächen-Analyse'!P80","v":""},null,"Preisgestaltung für alkoholische Produkte ",{"$f":"C82","v":""},{"$f":"D82","v":""}]
[null,{"$f":"'2 Stärken-Schwächen-Analyse'!Q82","v":"Adäquate Beratungsangebote (Behandlung und soziale Integration)"},{"$f":"'2 Stärken-Schwächen-Analyse'!H82","v":""},{"$f":"'2 Stärken-Schwächen-Analyse'!P82","v":""},null,"Sensibilisierung und Information der Öffentlichkeit",{"$f":"C89","v":""},{"$f":"D89","v":""}]
[null,{"$f":"IF('2 Stärken-Schwächen-Analyse'!B84=\"Weiterer Faktor zu diesem Schwerpunkt? \nBitte hier eintragen\",\"Weiterer Faktor zu diesem Schwerpunkt (optional)\",'2 Stärken-Schwächen-Analyse'!B84)","v":"Weiterer Faktor zu diesem Schwerpunkt (optional)"},{"$f":"'2 Stärken-Schwächen-Analyse'!H84","v":""},{"$f":"'2 Stärken-Schwächen-Analyse'!P84","v":""}]
[null,"Beurteilung insgesamt ",{"$f":"'2 Stärken-Schwächen-Analyse'!H87","v":""},{"$f":"'2 Stärken-Schwächen-Analyse'!P87","v":""}]
[]
[null,"Vermeidung von gesundheitlichen Folgen des Alkoholkonsums",{"$f":"AVERAGE(C42:C47)","v":{"$error":"#DIV/0!"}},{"$f":"IF(AVERAGE(D42:D47)<C41,C41,AVERAGE(D42:D47))","v":{"$error":"#DIV/0!"}}]
[null,{"$f":"'2 Stärken-Schwächen-Analyse'!Q94","v":"Massnahmen zur Prävention von Alkoholmissbrauch und Abhängigkeit (Individ. und gesellsch. Schadensminderung)"},{"$f":"'2 Stärken-Schwächen-Analyse'!H94","v":""},{"$f":"'2 Stärken-Schwächen-Analyse'!P94","v":""}]
[null,{"$f":"'2 Stärken-Schwächen-Analyse'!Q96","v":"Massnahmen zur Prävention von Alkohol und Gewalt (Individ. und gesellsch. Schadensminderung)"},{"$f":"'2 Stärken-Schwächen-Analyse'!H96","v":""},{"$f":"'2 Stärken-Schwächen-Analyse'!P96","v":""}]
[null,{"$f":"'2 Stärken-Schwächen-Analyse'!Q98","v":"Massnahmen zur Prävention von Mischkonsum (Individ. und gesellsch. Schadensminderung)"},{"$f":"'2 Stärken-Schwächen-Analyse'!H98","v":""},{"$f":"'2 Stärken-Schwächen-Analyse'!P98","v":""}]
[null,{"$f":"'2 Stärken-Schwächen-Analyse'!Q100","v":"Massnahmen in Bezug auf Alkohol und Sexualität (Individ. und gesellsch. Schadensminderung)"},{"$f":"'2 Stärken-Schwächen-Analyse'!H100","v":""},{"$f":"'2 Stärken-Schwächen-Analyse'!P100","v":""}]
[null,{"$f":"'2 Stärken-Schwächen-Analyse'!Q102","v":"Zweckgebundene Verwendung der Gelder aus dem Alkoholzehntel (Individ. und gesellsch. Schadensminderung)"},{"$f":"'2 Stärken-Schwächen-Analyse'!H102","v":""},{"$f":"'2 Stärken-Schwächen-Analyse'!P102","v":""}]
[null,{"$f":"IF('2 Stärken-Schwächen-Analyse'!B104=\"Weiterer Faktor zu diesem Schwerpunkt? \nBitte hier eintragen\",\"Weiterer Faktor zu diesem Schwerpunkt (optional)\",'2 Stärken-Schwächen-Analyse'!B104)","v":"Weiterer Faktor zu diesem Schwerpunkt (optional)"},{"$f":"'2 Stärken-Schwächen-Analyse'!H104","v":""},{"$f":"'2 Stärken-Schwächen-Analyse'!P104","v":""}]
[null,"Beurteilung insgesamt ",{"$f":"'2 Stärken-Schwächen-Analyse'!H107","v":""},{"$f":"'2 Stärken-Schwächen-Analyse'!P107","v":""}]
[]
[null,"Gewährleistung der Sicherheit im öffentlichen Raum",{"$f":"AVERAGE(C51:C54)","v":{"$error":"#DIV/0!"}},{"$f":"IF(AVERAGE(D51:D54)<C50,C50,AVERAGE(D51:D54))","v":{"$error":"#DIV/0!"}}]
[null,{"$f":"'2 Stärken-Schwächen-Analyse'!Q113","v":"Sicherheitskonzepte an (Gross-)Veranstaltungen (Individ. und gesellsch. Schadensminderung)"},{"$f":"'2 Stärken-Schwächen-Analyse'!H113","v":""},{"$f":"'2 Stärken-Schwächen-Analyse'!P113","v":""}]
[null,{"$f":"'2 Stärken-Schwächen-Analyse'!Q115","v":"Zusammenarbeit der Akteure im öffentlichen Raum (Individ. und gesellsch. Schadensminderung)"},{"$f":"'2 Stärken-Schwächen-Analyse'!H115","v":""},{"$f":"'2 Stärken-Schwächen-Analyse'!P115","v":""}]
[null,{"$f":"'2 Stärken-Schwächen-Analyse'!Q117","v":"Alkoholverbot rund um Sportstadien (Individ. und gesellsch. Schadensminderung)"},{"$f":"'2 Stärken-Schwächen-Analyse'!H117","v":""},{"$f":"'2 Stärken-Schwächen-Analyse'!P117","v":""}]
[null,{"$f":"IF('2 Stärken-Schwächen-Analyse'!B119=\"Weiterer Faktor zu diesem Schwerpunkt? \nBitte hier eintragen\",\"Weiterer Faktor zu diesem Schwerpunkt (optional)\",'2 Stärken-Schwächen-Analyse'!B119)","v":"Weiterer Faktor zu diesem Schwerpunkt (optional)"},{"$f":"'2 Stärken-Schwächen-Analyse'!H119","v":""},{"$f":"'2 Stärken-Schwächen-Analyse'!P119","v":""}]
[null,"Beurteilung insgesamt ",{"$f":"'2 Stärken-Schwächen-Analyse'!H122","v":""},{"$f":"'2 Stärken-Schwächen-Analyse'!P122","v":""}]
[]
[null,"Vollzug geltender Bestimmungen",{"$f":"AVERAGE(C58:C61)","v":{"$error":"#DIV/0!"}},{"$f":"IF(AVERAGE(D58:D61)<C57,C57,AVERAGE(D58:D61))","v":{"$error":"#DIV/0!"}}]
[null,{"$f":"'2 Stärken-Schwächen-Analyse'!Q128","v":"Vollzug geltender Bestimmungen im Strassenverkehr (Individ. und gesellsch. Schadensminderung)"},{"$f":"'2 Stärken-Schwächen-Analyse'!H128","v":""},{"$f":"'2 Stärken-Schwächen-Analyse'!P128","v":""}]
[null,{"$f":"'2 Stärken-Schwächen-Analyse'!Q130","v":"Vollzug geltender Jugendschutzbestimmungen (Individ. und gesellsch. Schadensminderung)"},{"$f":"'2 Stärken-Schwächen-Analyse'!H130","v":""},{"$f":"'2 Stärken-Schwächen-Analyse'!P130","v":""}]
[null,{"$f":"'2 Stärken-Schwächen-Analyse'!Q132","v":"Testkäufe (Individ. und gesellsch. Schadensminderung)"},{"$f":"'2 Stärken-Schwächen-Analyse'!H132","v":""},{"$f":"'2 Stärken-Schwächen-Analyse'!P132","v":""}]
[null,{"$f":"IF('2 Stärken-Schwächen-Analyse'!B134=\"Weiterer Faktor zu diesem Schwerpunkt? \nBitte hier eintragen\",\"Weiterer Faktor zu diesem Schwerpunkt (optional)\",'2 Stärken-Schwächen-Analyse'!B134)","v":"Weiterer Faktor zu diesem Schwerpunkt (optional)"},{"$f":"'2 Stärken-Schwächen-Analyse'!H134","v":""},{"$f":"'2 Stärken-Schwächen-Analyse'!P134","v":""}]
[null,"Beurteilung insgesamt ",{"$f":"'2 Stärken-Schwächen-Analyse'!H137","v":""},{"$f":"'2 Stärken-Schwächen-Analyse'!P137","v":""}]
[]
[null,"Einschränkung der Erhältlichkeit von alkoholischen Produkten",{"$f":"AVERAGE(C65:C68)","v":{"$error":"#DIV/0!"}},{"$f":"IF(AVERAGE(D65:D68)<C64,C64,AVERAGE(D65:D68))","v":{"$error":"#DIV/0!"}}]
[null,{"$f":"'2 Stärken-Schwächen-Analyse'!Q144","v":"Zeitliche Beschränkung von Verkauf/Konsum (Marktregulierung und Jugendschutz)"},{"$f":"'2 Stärken-Schwächen-Analyse'!H144","v":""},{"$f":"'2 Stärken-Schwächen-Analyse'!P144","v":""}]
[null,{"$f":"'2 Stärken-Schwächen-Analyse'!Q146","v":"Örtliche Beschränkung von Verkauf/Konsum (Marktregulierung und Jugendschutz)"},{"$f":"'2 Stärken-Schwächen-Analyse'!H146","v":""},{"$f":"'2 Stärken-Schwächen-Analyse'!P146","v":""}]
[null,{"$f":"'2 Stärken-Schwächen-Analyse'!Q148","v":"Weitergabeverbot (Marktregulierung und Jugendschutz)"},{"$f":"'2 Stärken-Schwächen-Analyse'!H148","v":""},{"$f":"'2 Stärken-Schwächen-Analyse'!P148","v":""}]
[null,{"$f":"IF('2 Stärken-Schwächen-Analyse'!B150=\"Weiterer Faktor zu diesem Schwerpunkt? \nBitte hier eintragen\",\"Weiterer Faktor zu diesem Schwerpunkt (optional)\",'2 Stärken-Schwächen-Analyse'!B150)","v":"Weiterer Faktor zu diesem Schwerpunkt (optional)"},{"$f":"'2 Stärken-Schwächen-Analyse'!H150","v":""},{"$f":"'2 Stärken-Schwächen-Analyse'!P150","v":""}]
[null,"Beurteilung insgesamt ",{"$f":"'2 Stärken-Schwächen-Analyse'!H153","v":""},{"$f":"'2 Stärken-Schwächen-Analyse'!P153","v":""}]
[]
[null,"Einschränkung der Werbung für alkoholische Produkte",{"$f":"AVERAGE(C72:C74)","v":{"$error":"#DIV/0!"}},{"$f":"IF(AVERAGE(D72:D74)<C71,C71,AVERAGE(D72:D74))","v":{"$error":"#DIV/0!"}}]
[null,{"$f":"'2 Stärken-Schwächen-Analyse'!Q159","v":"Örtliche Werbeeinschränkung (Marktregulierung und Jugendschutz)"},{"$f":"'2 Stärken-Schwächen-Analyse'!H159","v":""},{"$f":"'2 Stärken-Schwächen-Analyse'!P159","v":""}]
[null,{"$f":"'2 Stärken-Schwächen-Analyse'!Q161","v":"Einschränkung des Sponsorings (Marktregulierung und Jugendschutz)"},{"$f":"'2 Stärken-Schwächen-Analyse'!H161","v":""},{"$f":"'2 Stärken-Schwächen-Analyse'!P161","v":""}]
[null,{"$f":"IF('2 Stärken-Schwächen-Analyse'!B163=\"Weiterer Faktor zu diesem Schwerpunkt? \nBitte hier eintragen\",\"Weiterer Faktor zu diesem Schwerpunkt (optional)\",'2 Stärken-Schwächen-Analyse'!B163)","v":"Weiterer Faktor zu diesem Schwerpunkt (optional)"},{"$f":"'2 Stärken-Schwächen-Analyse'!H163","v":""},{"$f":"'2 Stärken-Schwächen-Analyse'!P163","v":""}]
[null,"Beurteilung insgesamt ",{"$f":"'2 Stärken-Schwächen-Analyse'!H166","v":""},{"$f":"'2 Stärken-Schwächen-Analyse'!P166","v":""}]
[]
[null,"Preisgestaltung für alkoholische Produkte",{"$f":"AVERAGE(C78:C81)","v":{"$error":"#DIV/0!"}},{"$f":"IF(AVERAGE(D78:D81)<C77,C77,AVERAGE(D78:D81))","v":{"$error":"#DIV/0!"}}]
[null,{"$f":"'2 Stärken-Schwächen-Analyse'!Q172","v":"Verbot von Lockvogelangeboten (Marktregulierung und Jugendschutz)"},{"$f":"'2 Stärken-Schwächen-Analyse'!H172","v":""},{"$f":"'2 Stärken-Schwächen-Analyse'!P172","v":""}]
[null,{"$f":"'2 Stärken-Schwächen-Analyse'!Q174","v":"Sirupartikel (Marktregulierung und Jugendschutz)"},{"$f":"'2 Stärken-Schwächen-Analyse'!H174","v":""},{"$f":"'2 Stärken-Schwächen-Analyse'!P174","v":""}]
[null,{"$f":"'2 Stärken-Schwächen-Analyse'!Q176","v":"Sondergewerbesteuer (Marktregulierung und Jugendschutz)"},{"$f":"'2 Stärken-Schwächen-Analyse'!H176","v":""},{"$f":"'2 Stärken-Schwächen-Analyse'!P176","v":""}]
[null,{"$f":"IF('2 Stärken-Schwächen-Analyse'!B178=\"Weiterer Faktor zu diesem Schwerpunkt? \nBitte hier eintragen\",\"Weiterer Faktor zu diesem Schwerpunkt (optional)\",'2 Stärken-Schwächen-Analyse'!B178)","v":"Weiterer Faktor zu diesem Schwerpunkt (optional)"},{"$f":"'2 Stärken-Schwächen-Analyse'!H178","v":""},{"$f":"'2 Stärken-Schwächen-Analyse'!P178","v":""}]
[null,"Beurteilung insgesamt ",{"$f":"'2 Stärken-Schwächen-Analyse'!H181","v":""},{"$f":"'2 Stärken-Schwächen-Analyse'!P181","v":""}]
[]
[null,"Sensibilisierung und Information der Öffentlichkeit",{"$f":"AVERAGE(C85:C88)","v":{"$error":"#DIV/0!"}},{"$f":"IF(AVERAGE(D85:D88)<C84,C84,AVERAGE(D85:D88))","v":{"$error":"#DIV/0!"}}]
[null,{"$f":"'2 Stärken-Schwächen-Analyse'!Q188","v":"Information und Sensibilisierung der Öffentlichkeit (Information und Sensibilisierung)"},{"$f":"'2 Stärken-Schwächen-Analyse'!H188","v":""},{"$f":"'2 Stärken-Schwächen-Analyse'!P188","v":""}]
[null,{"$f":"'2 Stärken-Schwächen-Analyse'!Q190","v":"Information und Sensibilisierung in relevanten Settings (Information und Sensibilisierung)"},{"$f":"'2 Stärken-Schwächen-Analyse'!H190","v":""},{"$f":"'2 Stärken-Schwächen-Analyse'!P190","v":""}]
[null,{"$f":"'2 Stärken-Schwächen-Analyse'!Q192","v":"Kommunikation mit Medien (Information und Sensibilisierung)"},{"$f":"'2 Stärken-Schwächen-Analyse'!H192","v":""},{"$f":"'2 Stärken-Schwächen-Analyse'!P192","v":""}]
[null,{"$f":"IF('2 Stärken-Schwächen-Analyse'!B194=\"Weiterer Faktor zu diesem Schwerpunkt? \nBitte hier eintragen\",\"Weiterer Faktor zu diesem Schwerpunkt (optional)\",'2 Stärken-Schwächen-Analyse'!B194)","v":"Weiterer Faktor zu diesem Schwerpunkt (optional)"},{"$f":"'2 Stärken-Schwächen-Analyse'!H194","v":""},{"$f":"'2 Stärken-Schwächen-Analyse'!P194","v":""}]
[null,"Beurteilung insgesamt ",{"$f":"'2 Stärken-Schwächen-Analyse'!H197","v":""},{"$f":"'2 Stärken-Schwächen-Analyse'!P197","v":""}]